program: Gaussian 09
title: 000030208
version: EM64L-G09RevD.01
frameworkgroup: C1[X(C13H6Cl6N2O)]
method: RPBEPBE
basis: SDD
operation: Freq
keyword: #p
keyword: freq=noraman
keyword: PBEPBE/SDD
title: #p freq=noraman PBEPBE/SDD
converged: YES YES NO NO
title: Mulliken charges:
elementType: Cl Cl Cl Cl Cl Cl O N N C C C C C C C C C C C C C H H H H H H
charge: -0.001620 -0.001692 -0.032331 -0.032634 -0.026592 -0.026588 -0.182344 -0.501193 -0.501449 0.741266 0.741474 0.226099 -0.239248 -0.239441 -0.290026 -0.290102 -0.231385 -0.231178 -0.232936 -0.233026 -0.095342 -0.095412 0.316891 0.316713 0.285211 0.285194 0.285842 0.285850
chargesum: 0.00000
title: Mulliken charges with hydrogens summed into heavy atoms:
elementType: Cl Cl Cl Cl Cl Cl O N N C C C C C C C C C C C C C
charge: -0.001620 -0.001692 -0.032331 -0.032634 -0.026592 -0.026588 -0.182344 -0.184302 -0.184736 0.741266 0.741474 0.226099 -0.239248 -0.239441 -0.290026 -0.290102 0.053825 0.054015 0.052906 0.052824 -0.095342 -0.095412
polarizability: 3.41986974e+02 1.79225262e+01 2.00409005e+02 3.22020972e-02 5.04831930e-04 1.39088850e+02
1716.lowfreq: -5.4067 -5.2968 -1.8767 -0.0024 0.0016 0.0017 15.2025 18.3819 22.8936
frequency: 15.1989 18.3814 22.8934 45.2908 71.3951 89.9836 94.6504 130.2661 135.5636 140.1253 171.0134 174.9962 185.4887 193.5737 198.0720 198.6106 216.8500 266.7671 312.1403 336.0599 336.8045 349.8428 351.2720 371.4300 409.5136 409.5536 463.9957 474.3261 501.5290 502.8355 513.7832 518.4732 541.5878 555.7070 575.1747 655.6352 674.5844 699.1395 711.5570 745.2437 747.5751 756.7496 809.0502 847.1880 853.7615 853.7843 865.8305 865.8496 884.1418 985.6831 1050.7297 1063.9438 1110.0385 1112.5915 1169.7219 1183.7747 1190.0480 1265.0250 1280.9468 1336.9038 1341.4459 1378.9141 1379.0042 1434.0223 1446.9744 1468.0699 1475.1744 1560.2685 1560.8187 1588.7545 1589.5344 1677.9588 3186.8049 3186.8085 3189.5431 3189.5862 3501.6187 3506.5414
redmass: 18.6943 19.5912 20.7782 26.0643 16.7552 9.3581 16.2334 16.4571 12.9536 10.0939 19.6512 23.0282 11.8951 22.2404 4.8943 4.9735 18.0399 6.2991 6.7618 8.4461 10.9136 18.9682 15.0968 11.7441 8.1042 8.1353 8.5726 1.3408 5.3677 5.1637 7.2344 1.6296 4.0701 4.3863 3.1596 6.7227 9.4600 5.7164 7.0207 10.1662 10.5135 10.3324 6.8177 6.4675 1.4098 1.4073 1.3749 1.3760 6.2323 6.7336 3.2324 2.5204 3.0777 3.3541 2.1144 1.5384 1.8780 2.4532 2.2868 3.6332 4.3915 5.6061 5.6115 1.8918 2.9188 2.3373 3.7832 6.8326 6.5661 9.1190 9.3391 7.2563 1.0935 1.0935 1.0940 1.0940 1.0759 1.0755
irintensity: 0.1289 0.0016 0.0119 0.4908 0.0026 5.6683 0.0081 0.0670 1.9995 0.0076 2.1995 0.1268 6.7721 0.1277 0.0294 0.4127 0.0103 8.0356 0.2755 4.0155 10.4696 0.9529 0.4583 31.4598 3.6316 6.4028 1.0494 202.2314 2.1887 0.2138 12.1890 54.3690 40.4827 3.0622 9.9241 48.2208 20.9414 10.0339 13.8019 0.4263 112.4318 29.8958 96.1423 68.0505 40.8341 26.5796 4.0638 9.4779 0.0502 0.4797 0.2360 1.2567 77.9877 0.5628 254.7784 7.2064 189.4486 92.4124 3.1352 27.1683 211.7001 5.5846 21.4751 30.5280 109.2965 1243.1208 4.6475 18.4180 95.5776 17.2074 28.2479 131.5884 3.0088 1.3218 1.4458 1.2723 25.3411 53.8845
temp: 298.150 k
press: 1.00000 atm
elementType: 17 17 17 17 17 17 8 7 7 6 6 6 6 6 6 6 6 6 6 6 6 6 1 1 1 1 1 1
symmnumber: 1
zpe: 426316.1 jmol-1
zpe.correction: 0.162375 hartree
zpe.thermalcorrener: 0.183793 hartree
zpe.thermalcorrenthalpy: 0.184737 hartree
zpe.thermalcorrgfe: 0.107974 hartree
zpe.sumelectzpe: -3442.526359 hartree
zpe.sumelectthermal: -3442.504941 hartree
zpe.sumelectthermalent: -3442.503997 hartree
zpe.sumelectthermalfe: -3442.580760 hartree
dipole: -0.0017 0.0047 3.5305
dipole: 3.5305
quadrupole: -165.3872 -166.0418 -166.4694
quadrupole: 1.4365 -0.0015 0.0210
quadrupole: 0.5789 -0.0757 -0.5033 1.4365 -0.0015 0.0210
hfenergy: -3442.6887343 hartree
pointgroup: C01 [X(C13H6Cl6N2O1)]
dipole: -0.0007535 0.0004171 1.389011 debye
polarizability: 339.3555557|26.207655|203.0403572|0.0573741|0.0654589|139.0889171 unknown
InChI: InChI=1S/C13H6Cl6N2O/c14-5-1-7(16)11(8(17)2-5)20-13(22)21-12-9(18)3-6(15)4-10(12)19/h1-4,20-21H
charge 0 multiplicity 1
28 atoms
Cl -1.972988 2.445241 -0.580517
Cl 1.967773 -2.442214 -0.582098
Cl -2.79861 -2.577312 1.727127
Cl 2.803339 2.577836 1.72829
Cl -6.819163 -0.132833 -1.214008
Cl 6.818888 0.126374 -1.21418
O  -0.001288 0.004787 -1.099994
N  -1.154171 -0.140693 0.964138
N  1.153697 0.145727 0.963819
C  -2.46852 -0.117825 0.443807
C  2.467709 0.120026 0.442971
C  -0.000816 0.00433 0.151272
C  -2.982363 0.968277 -0.317383
C  2.979447 -0.966804 -0.318724
C  -3.376763 -1.17928 0.709728
C  3.378607 1.179079 0.709714
C  -4.288748 0.969762 -0.842165
C  4.285972 -0.970807 -0.843236
C  -4.698725 -1.204262 0.236433
C  4.700645 1.20157 0.236702
C  -5.127538 -0.123035 -0.556956
C  5.127186 0.119913 -0.55738
H  -1.028243 -0.633596 1.853373
H  1.029592 0.641877 1.851608
H  -4.643978 1.815968 -1.4345
H  4.639413 -1.817558 -1.435864
H  -5.360754 -2.042424 0.46375
H  5.3645 2.038073 0.464773
