program: Orca
programVersion: 4.2.1
elementType: Cl Cl O O O N N N C C C C C C C C C C C C C C C C C C C H H H H H H H H H H H H H H H H H
charge: 0
multiplicity: 1
keywords: wb97x-d3
keywords: def2-TZVPP
keywords: def2/J RIJCOSX GRIDX6 NOFINALGRIDX
keywords: grid4 nofinalgrid
keywords: scfconv7
keywords: smallprint printgap noloewdin
keywords: NOSOSCF
formula: C19H17Cl2N3O3
InChI: InChI=1S/C19H17Cl2N3O3/c1-13-9-25-19(27-13,10-24-12-22-11-23-24)17-7-6-16(8-18(17)21)26-15-4-2-14(20)3-5-15/h2-8,11-13H,9-10H2,1H3
44 atoms
Cl 2.267427 1.205384 -2.069531
Cl -7.162365 -0.381913 1.38604
O  3.247594 -1.32637 1.5290
O  3.998002 -0.029022 -0.110908
O  -2.180137 -0.994904 -1.628777
N  2.562174 2.231746 1.061683
N  1.304465 2.662529 0.918758
N  2.739467 4.097296 -0.036556
C  2.926034 -0.201289 0.754851
C  4.114072 -2.163061 0.769554
C  2.861564 0.990082 1.715281
C  4.384642 -1.327445 -0.491152
C  1.592985 -0.418863 0.038409
C  3.49649 -3.515529 0.486211
C  1.219889 0.172642 -1.165915
C  0.638584 -1.212029 0.674829
C  -0.044309 -0.022869 -1.706411
C  -0.624802 -1.418039 0.158329
C  -0.964363 -0.811604 -1.043057
C  3.404479 3.098153 0.47913
C  1.460019 3.780659 0.254081
C  -3.308282 -0.838441 -0.878459
C  -3.410115 0.114072 0.128016
C  -4.394139 -1.643537 -1.190171
C  -4.599174 0.250739 0.825338
C  -5.584649 -1.498825 -0.497918
C  -5.681687 -0.555477 0.512355
H  5.032983 -2.294641 1.350347
H  3.824577 1.077324 2.220955
H  2.095414 0.812047 2.468306
H  5.434189 -1.309942 -0.783476
H  3.793347 -1.686511 -1.343677
H  2.581226 -3.421571 -0.099082
H  3.260284 -4.043425 1.409549
H  4.195956 -4.135801 -0.076933
H  0.897885 -1.690296 1.609045
H  -0.315014 0.448829 -2.640931
H  -1.333912 -2.042669 0.685245
H  4.473536 2.95534 0.457322
H  0.619779 4.396354 -0.025731
H  -2.572628 0.755193 0.372056
H  -4.307017 -2.379519 -1.978305
H  -4.681111 0.992089 1.607926
H  -6.431413 -2.125492 -0.74079
totalener: -2044.66583300 hartree
nucrepener: 2785.01544893 hartree
electener: -4829.68128193 hartree
oneelecener: -8340.63096560 hartree
twoeener: 3510.94968367 hartree
kineticenergy: 2038.72708602 hartree
xcener: -149.992215411614 hartree
chargesum: -0.0000000
charge: -0.052643 -0.082392 -0.362306 -0.328642 -0.300969 0.096779 -0.315940 -0.323184 0.585683 0.139710 -0.081910 -0.031512 -0.070186 -0.281528 -0.025320 -0.203412 -0.149292 -0.152565 0.180991 0.045649 0.068111 0.237140 -0.150845 -0.219760 -0.124411 -0.087953 0.061655 0.073581 0.108788 0.120134 0.098688 0.084208 0.083359 0.094853 0.092144 0.134905 0.119048 0.137061 0.139730 0.126908 0.140459 0.128333 0.124721 0.122127
qa: -0.0526 -0.0824 -0.3623 -0.3286 -0.3010 0.0968 -0.3159 -0.3232 0.5857 0.1397 -0.0819 -0.0315 -0.0702 -0.2815 -0.0253 -0.2034 -0.1493 -0.1526 0.1810 0.0456 0.0681 0.2371 -0.1508 -0.2198 -0.1244 -0.0880 0.0617 0.0736 0.1088 0.1201 0.0987 0.0842 0.0834 0.0949 0.0921 0.1349 0.1190 0.1371 0.1397 0.1269 0.1405 0.1283 0.1247 0.1221
va: 1.2654 1.2223 2.0087 2.0348 2.1033 3.3251 2.8316 3.0560 3.8123 3.9175 3.8723 3.9683 3.5508 3.9606 3.9916 4.0017 4.0755 3.9729 3.9174 4.0903 4.0406 3.8239 3.9272 4.0428 3.9988 3.9741 3.9326 0.9998 1.0214 1.0158 0.9982 1.0019 1.0023 1.0067 1.0096 1.0263 1.0286 1.0028 1.0090 1.0030 1.0080 1.0127 1.0107 1.0094
dispcorr: -0.025992380 hartree
energy: -2044.691825377669
dipole: 22.66613 -21.62684 1.03929 -14.49452 12.71817 -1.77635 5.07249 -4.71480 0.35769
magnitude: 2.08889 au
magnitude: 5.30955 debye
