program: Orca
programVersion: 4.2.1
elementType: Cl Cl O O O N N N C C C C C C C C C C C C C C C C C C C H H H H H H H H H H H H H H H H H
charge: 0
multiplicity: 1
keywords: wb97x-d3
keywords: def2-TZVPP
keywords: def2/J RIJCOSX GRIDX6 NOFINALGRIDX
keywords: grid4 nofinalgrid
keywords: scfconv7
keywords: smallprint printgap noloewdin
keywords: NOSOSCF
formula: C19H17Cl2N3O3
InChI: InChI=1S/C19H17Cl2N3O3/c1-13-9-25-19(27-13,10-24-12-22-11-23-24)17-7-6-16(8-18(17)21)26-15-4-2-14(20)3-5-15/h2-8,11-13H,9-10H2,1H3
44 atoms
Cl 1.149437 -0.450617 1.917131
Cl -6.866751 0.689754 0.572053
O  3.783663 -0.366034 0.715163
O  4.117989 -0.260924 -1.477282
O  -2.017327 -1.529024 -1.8459
N  2.474538 2.245333 0.597675
N  1.20603 2.602209 0.370105
N  1.759935 2.991749 2.508161
C  3.241635 0.13852 -0.462825
C  4.498898 -1.556102 0.41478
C  3.290461 1.669938 -0.432603
C  4.550589 -1.555229 -1.123354
C  1.8286 -0.371358 -0.743294
C  3.841162 -2.788564 0.999083
C  0.855533 -0.61959 0.224063
C  1.44855 -0.527089 -2.074583
C  -0.428092 -1.011449 -0.124575
C  0.171044 -0.900975 -2.445967
C  -0.772488 -1.137346 -1.460591
C  2.785445 2.480106 1.881027
C  0.818828 3.040852 1.542183
C  -3.112149 -0.977414 -1.246494
C  -4.221934 -1.792517 -1.080731
C  -3.158643 0.355701 -0.857317
C  -5.382402 -1.278021 -0.527124
C  -4.316909 0.865356 -0.29461
C  -5.424272 0.048609 -0.1304
H  5.501939 -1.443698 0.838056
H  2.951721 2.066061 -1.388724
H  4.325678 1.979006 -0.280296
H  5.553525 -1.708687 -1.521793
H  3.889527 -2.324035 -1.542587
H  4.447537 -3.670506 0.784867
H  2.848171 -2.952636 0.579146
H  3.743512 -2.707275 2.080493
H  2.176632 -0.33591 -2.851046
H  -1.155785 -1.202925 0.652847
H  -0.096506 -1.001733 -3.488977
H  3.754049 2.260075 2.30121
H  -0.177839 3.41944 1.706303
H  -4.177081 -2.828371 -1.389476
H  -2.300067 1.002362 -0.98633
H  -6.248048 -1.912522 -0.397854
H  -4.355354 1.901733 0.010425
totalener: -2044.66542623 hartree
nucrepener: 2817.46274782 hartree
electener: -4862.12817405 hartree
oneelecener: -8405.61562899 hartree
twoeener: 3543.48745494 hartree
kineticenergy: 2038.72896432 hartree
xcener: -149.993520594918 hartree
chargesum: -0.0000000
charge: -0.052058 -0.081686 -0.342070 -0.343669 -0.300132 0.093253 -0.313297 -0.323082 0.584338 0.143016 -0.071627 -0.035107 -0.100448 -0.284874 -0.074242 -0.145195 -0.105199 -0.207615 0.201121 0.045777 0.067013 0.240351 -0.222784 -0.154499 -0.086055 -0.114904 0.057383 0.074096 0.118668 0.109310 0.097746 0.083401 0.092991 0.082143 0.098921 0.134365 0.126310 0.128587 0.140451 0.125149 0.128312 0.139529 0.122055 0.124260
qa: -0.0521 -0.0817 -0.3421 -0.3437 -0.3001 0.0933 -0.3133 -0.3231 0.5843 0.1430 -0.0716 -0.0351 -0.1004 -0.2849 -0.0742 -0.1452 -0.1052 -0.2076 0.2011 0.0458 0.0670 0.2404 -0.2228 -0.1545 -0.0861 -0.1149 0.0574 0.0741 0.1187 0.1093 0.0977 0.0834 0.0930 0.0821 0.0989 0.1344 0.1263 0.1286 0.1405 0.1251 0.1283 0.1395 0.1221 0.1243
va: 1.2629 1.2230 2.0274 2.0216 2.1086 3.3278 2.8282 3.0576 3.8230 3.9167 3.8647 3.9719 3.5880 3.9582 4.0137 3.9633 3.9339 4.0636 3.9054 4.0910 4.0433 3.8226 4.0481 3.9357 3.9720 3.9959 3.9391 0.9984 1.0168 1.0207 0.9968 0.9970 1.0109 1.0013 1.0095 1.0253 1.0223 1.0132 1.0092 1.0037 1.0128 1.0068 1.0095 1.0108
dispcorr: -0.026532605 hartree
energy: -2044.691958833783
dipole: 27.36858 -25.86911 1.49947 -9.28912 8.06606 -1.22306 -7.78338 6.74824 -1.03513
magnitude: 2.19449 au
magnitude: 5.57795 debye
