program: Orca
programVersion: 4.2.1
elementType: Cl Cl O O O N N N C C C C C C C C C C C C C C C C C C C H H H H H H H H H H H H H H H H H
charge: 0
multiplicity: 1
keywords: wb97x-d3
keywords: def2-TZVPP
keywords: def2/J RIJCOSX GRIDX6 NOFINALGRIDX
keywords: grid4 nofinalgrid
keywords: scfconv7
keywords: smallprint printgap noloewdin
keywords: NOSOSCF
formula: C19H17Cl2N3O3
InChI: InChI=1S/C19H17Cl2N3O3/c1-13-9-25-19(27-13,10-24-12-22-11-23-24)17-7-6-16(8-18(17)21)26-15-4-2-14(20)3-5-15/h2-8,11-13H,9-10H2,1H3
44 atoms
Cl 1.507477 -0.454624 2.914425
Cl -7.08793 -2.13355 -2.797158
O  3.108553 -0.336382 0.453753
O  2.485617 0.986163 -1.254467
O  -3.165712 -0.40637 1.190326
N  4.106892 2.333883 0.61219
N  5.074651 1.906673 1.42862
N  5.955763 2.966367 -0.341284
C  2.297784 0.745786 0.113853
C  3.855842 -0.757708 -0.67508
C  2.727057 2.020085 0.856805
C  3.045979 -0.177057 -1.823575
C  0.838514 0.424823 0.415161
C  3.98022 -2.262936 -0.682779
C  0.407585 -0.11808 1.625448
C  -0.138055 0.698796 -0.53674
C  -0.926993 -0.40822 1.856687
C  -1.478952 0.427559 -0.326574
C  -1.870508 -0.138589 0.877812
C  4.652185 2.958834 -0.443226
C  6.162782 2.308845 0.820586
C  -4.037009 -0.803052 0.217677
C  -5.298068 -0.227745 0.211159
C  -3.713959 -1.792095 -0.702493
C  -6.242835 -0.642033 -0.71366
C  -4.654844 -2.197997 -1.63368
C  -5.915822 -1.621866 -1.636677
H  4.854655 -0.303187 -0.646411
H  2.594524 1.901204 1.929742
H  2.102703 2.852487 0.528078
H  3.651411 0.109301 -2.683313
H  2.265079 -0.873376 -2.156725
H  4.504995 -2.61458 0.204171
H  4.547656 -2.590967 -1.554514
H  2.999528 -2.738935 -0.710499
H  0.15835 1.140829 -1.477482
H  -1.237113 -0.83974 2.798466
H  -2.203699 0.662428 -1.094528
H  4.068073 3.388667 -1.241473
H  7.143229 2.130249 1.233443
H  -5.541843 0.537887 0.935506
H  -2.73497 -2.253469 -0.694239
H  -7.22811 -0.197281 -0.717857
H  -4.408326 -2.96909 -2.350163
totalener: -2044.66938506 hartree
nucrepener: 2696.83326397 hartree
electener: -4741.50264903 hartree
oneelecener: -8163.75849748 hartree
twoeener: 3422.25584845 hartree
kineticenergy: 2038.71457253 hartree
xcener: -149.987801482792 hartree
chargesum: -0.0000000
charge: -0.049824 -0.077587 -0.328894 -0.374451 -0.297955 0.105117 -0.293656 -0.328863 0.570041 0.126929 -0.137473 -0.003304 -0.118033 -0.262885 -0.002788 -0.104762 -0.209071 -0.183934 0.224637 0.028594 0.045247 0.246130 -0.214997 -0.170214 -0.088528 -0.110610 0.058928 0.069343 0.134877 0.123320 0.101856 0.078642 0.101865 0.082101 0.074784 0.138678 0.121706 0.136296 0.141921 0.130492 0.130753 0.136361 0.124490 0.124721
qa: -0.0498 -0.0776 -0.3289 -0.3745 -0.2980 0.1051 -0.2937 -0.3289 0.5700 0.1269 -0.1375 -0.0033 -0.1180 -0.2629 -0.0028 -0.1048 -0.2091 -0.1839 0.2246 0.0286 0.0452 0.2461 -0.2150 -0.1702 -0.0885 -0.1106 0.0589 0.0693 0.1349 0.1233 0.1019 0.0786 0.1019 0.0821 0.0748 0.1387 0.1217 0.1363 0.1419 0.1305 0.1308 0.1364 0.1245 0.1247
va: 1.2721 1.2272 2.0482 1.9906 2.1115 3.3623 2.8619 3.0564 3.8280 3.9394 3.8211 3.9355 3.6619 3.9707 4.0683 3.9051 4.1055 3.9723 3.8709 4.0816 4.0486 3.8181 4.0501 3.9670 3.9660 3.9834 3.9469 0.9950 1.0337 1.0075 1.0016 1.0016 1.0055 1.0061 1.0124 1.0272 1.0294 1.0053 1.0103 1.0023 1.0119 1.0024 1.0092 1.0105
dispcorr: -0.024163596 hartree
energy: -2044.693548656258
dipole: 22.41728 -23.32910 -0.91182 1.29823 -1.69973 -0.40150 -7.37274 6.59281 -0.77992
magnitude: 1.26527 au
magnitude: 3.21605 debye
