program: Gaussian 09
title: 000030127
version: EM64L-G09RevD.01
frameworkgroup: C1[X(C9H5Cl3N4)]
method: RPBEPBE
basis: SDD
operation: Freq
keyword: #p
keyword: freq=noraman
keyword: PBEPBE/SDD
title: #p freq=noraman PBEPBE/SDD
converged: NO YES NO NO
title: Mulliken charges:
elementType: Cl Cl Cl N N N N C C C C C C C C C H H H H H
charge: -0.047644 0.041875 0.043377 -0.408419 -0.014562 -0.006358 0.119484 0.488237 -0.262216 -0.461895 0.121052 -0.097750 -0.176831 -0.263566 -0.266706 -0.234999 0.349421 0.340589 0.234702 0.239143 0.263066
chargesum: 0.00000
title: Mulliken charges with hydrogens summed into heavy atoms:
elementType: Cl Cl Cl N N N N C C C C C C C C C
charge: -0.047644 0.041875 0.043377 -0.058998 -0.014562 -0.006358 0.119484 0.488237 0.078373 -0.227193 0.121052 -0.097750 0.062312 -0.000500 -0.266706 -0.234999
polarizability: 2.65980462e+02 -1.39518539e+00 1.88439780e+02 -1.39180030e-01 1.29135342e-01 5.57605035e+01
1716.lowfreq: -3.0434 -2.8060 -1.5163 -0.0011 -0.0008 0.0024 25.6462 50.6767 62.5455
frequency: 25.6295 50.6607 62.5445 140.3680 154.4123 160.4939 173.5450 184.2230 185.1574 277.0730 280.5562 325.0656 385.7694 392.5683 429.4710 442.3346 447.0687 564.7365 589.5558 619.7840 645.4179 677.0033 683.3720 686.1027 723.1387 785.7865 792.8450 795.1606 874.4345 885.9517 888.1037 930.5987 966.4205 969.8754 981.4304 1075.4935 1096.5750 1148.8279 1181.7888 1187.9620 1237.5238 1266.6420 1289.9569 1340.5137 1389.5563 1435.2604 1445.2460 1474.1421 1502.9583 1557.2830 1599.7144 1609.8041 3127.0012 3158.6998 3183.7521 3197.8032 3513.8030
redmass: 14.1483 6.5582 17.9744 13.8855 18.2158 9.3829 8.9588 17.7462 5.4580 4.7946 10.9732 5.7264 12.5884 17.4039 14.3015 3.1462 10.8761 4.7673 7.3128 11.8552 3.9897 7.8283 8.4763 2.1244 1.5962 2.2115 12.2579 2.8936 9.8500 9.4884 1.4002 1.3763 6.4920 1.3387 6.0878 2.0520 1.5874 5.4879 1.1007 10.2846 2.9133 4.5384 1.6680 3.6690 9.5264 3.0981 4.4755 2.9046 3.0989 5.7261 4.0564 6.6705 1.0897 1.0922 1.0975 1.0935 1.0754
irintensity: 0.3184 0.0043 0.0886 0.0041 0.3454 0.5679 0.1411 0.3752 0.0984 2.2451 4.3495 0.6613 7.0234 5.4984 4.7370 7.8679 3.2172 0.7623 27.9436 0.4233 5.1088 32.1582 35.8206 30.8169 26.6732 25.9322 80.4410 96.0611 53.2657 43.9135 1.2787 29.9334 57.9733 0.8853 4.2630 17.9851 5.8836 77.0350 5.0925 263.8199 17.5526 10.0061 114.9432 355.5947 46.9834 12.5124 528.1512 85.4503 661.0754 691.2315 301.3742 33.4132 8.6888 10.5633 3.3238 24.2211 54.9421
temp: 298.150 k
press: 1.00000 atm
elementType: 17 17 17 7 7 7 7 6 6 6 6 6 6 6 6 6 1 1 1 1 1
symmnumber: 1
zpe: 342113.8 jmol-1
zpe.correction: 0.130304 hartree
zpe.thermalcorrener: 0.143985 hartree
zpe.thermalcorrenthalpy: 0.144929 hartree
zpe.thermalcorrgfe: 0.087395 hartree
zpe.sumelectzpe: -1944.023276 hartree
zpe.sumelectthermal: -1944.009595 hartree
zpe.sumelectthermalent: -1944.008651 hartree
zpe.sumelectthermalfe: -1944.066185 hartree
dipole: 2.9187 -4.1980 -0.0124
dipole: 5.1129
quadrupole: -119.3198 -106.7193 -113.9814
quadrupole: -8.4108 -0.0092 0.0611
quadrupole: -5.9796 6.6209 -0.6413 -8.4108 -0.0092 0.0611
hfenergy: -1944.1535803 hartree
pointgroup: C01 [X(C9H5Cl3N4)]
dipole: -1.3205576 1.5088447 0.1609753 debye
dipolederiv: -0.2263774 -0.1721884 -0.0097658 -0.3384399 -0.6862378 -0.0417288 -0.0232967 -0.0464736 -0.0678894 -0.8360221 -0.3785205 -0.0157369 -0.4674859 -0.332941 -0.0144588 -0.0245904 -0.0168253 -0.0528255 -0.1130456 0.01957 0.0033544 0.2029717 -0.8833413 -0.0804068 0.0195577 -0.0747116 -0.0557895 -1.9974263 0.2109718 0.0619563 0.6311302 -0.3750948 -0.0204744 0.0974428 -0.0093592 -0.3219094 -1.2739248 0.4058362 0.0637993 1.0550105 -1.0778486 -0.1121374 0.121068 -0.0939307 -0.1418306 -2.1681213 0.0402137 0.0528508 -0.0094529 -0.568409 -0.0358786 0.0435745 -0.0379621 -0.1638502 -1.0558419 -0.4659779 -0.0189792 -0.2922256 -1.4666461 -0.1181052 -0.0046874 -0.1130898 -0.100185 1.3230193 0.0217746 -0.030168 0.382737 0.1739472 -0.0054866 0.0027189 0.0039299 0.1065202 -0.4023915 -0.1005636 -0.0007324 -0.2690791 -0.3253865 -0.0102893 -0.0152221 -0.0144284 -0.1129513 -0.3759412 0.0004745 0.0042617 0.06779 0.0062194 0.0158241 0.0098868 0.0177303 -0.2102346 2.4621914 -0.3161234 -0.0841242 -1.1662648 0.915782 0.0913499 -0.1526331 0.0684065 0.2490448 0.3367667 0.2634155 0.0114214 0.606111 1.094863 0.0774527 0.0387504 0.0872963 -0.0456879 0.2013518 0.0455204 -0.0049593 -0.0779127 0.1451665 0.0235875 -0.0141717 0.0200014 -0.1164367 -0.1628436 0.017977 0.0023148 -0.124438 -0.3741625 -0.016762 -0.009179 -0.020636 -0.1287506 2.3066984 0.3957729 -0.0167204 0.3214216 1.4472924 0.1171683 -0.0205605 0.1149781 0.0834728 1.5444253 0.0236752 -0.0324199 -0.4822165 2.0084646 0.1863005 -0.0772291 0.1721142 0.0926799 0.1659788 0.0145207 0.0051018 -0.0634154 0.2157827 -0.0066771 -0.0029418 -0.0088022 0.3094994 0.2522797 0.0194928 -0.0007925 0.0441027 0.072633 -0.0093981 0.0007028 -0.0088677 0.1724101 0.0608896 -0.099094 -0.0050841 -0.0722212 -0.0631732 -0.0173713 -0.0032234 -0.0167135 0.1738589 -0.0136435 0.0837056 0.0114372 0.0941218 -0.0200785 -0.0170906 0.0122633 -0.0168049 0.1573232 -0.0280218 -0.0304533 0.002985 -0.0422446 0.0931686 -0.0054181 0.0017701 -0.0058518 0.1735313 unknown
polarizability: 265.2309643|7.4403613|188.1062985|-4.7148402|11.1926922|56.8434823 unknown
InChI: InChI=1S/C9H5Cl3N4/c10-5-2-1-3-6(4-5)13-9-15-7(11)14-8(12)16-9/h1-4,13H
charge 0 multiplicity 1
21 atoms
Cl -3.725399 -2.563246 -0.106997
Cl 4.89533 1.597198 0.026879
Cl 2.398899 -3.145146 -0.342308
N  -0.092625 1.258339 0.109718
N  1.088686 -0.8173 -0.104508
N  2.223576 1.335701 0.062234
N  3.5106 -0.704367 -0.149634
C  -1.450758 0.833518 0.109434
C  -1.842069 -0.527093 0.008959
C  -2.433844 1.85477 0.218958
C  1.076238 0.553588 0.017376
C  -3.217031 -0.81864 0.022535
C  -3.800734 1.517904 0.228468
C  -4.214477 0.169176 0.130082
C  3.368249 0.646361 -0.024929
C  2.321814 -1.354603 -0.181006
H  0.068263 2.267117 0.194898
H  -1.09027 -1.312263 -0.076102
H  -2.129081 2.905456 0.295967
H  -4.553585 2.307859 0.3129
H  -5.273284 -0.101529 0.136676
