program: Gaussian 09
title: 000030125
version: EM64L-G09RevD.01
frameworkgroup: C1[X(C11H12Cl2N2O)]
method: RPBEPBE
basis: SDD
operation: Freq
keyword: #p
keyword: freq=noraman
keyword: PBEPBE/SDD
title: #p freq=noraman PBEPBE/SDD
converged: YES YES NO NO
title: Mulliken charges:
elementType: Cl Cl O N N C C C C C C C C C C C H H H H H H H H H H H H
charge: -0.004044 -0.015912 -0.265564 -0.133481 0.173016 -0.174100 -0.493449 -0.462883 -0.316024 0.115078 -0.672669 0.340653 -0.237738 -0.181844 -0.305224 -0.326044 0.259517 0.237774 0.250082 0.251647 0.253405 0.215117 0.244601 0.266633 0.205192 0.219680 0.292323 0.264258
chargesum: 0.00000
title: Mulliken charges with hydrogens summed into heavy atoms:
elementType: Cl Cl O N N C C C C C C C C C C C
charge: -0.004044 -0.015912 -0.265564 -0.133481 0.173016 0.085417 -0.005593 0.042168 0.143694 0.115078 0.018836 0.340653 0.054585 0.082414 -0.305224 -0.326044
polarizability: 1.92550092e+02 -2.58053588e+00 1.72374236e+02 8.28347481e+00 -4.74260543e+00 9.89880129e+01
1716.lowfreq: -8.1984 -7.5198 -3.9283 -0.0011 -0.0008 0.0017 21.5848 42.6011 56.2574
frequency: 21.4877 42.5740 56.2413 80.2205 109.3928 130.7335 148.4350 164.8658 172.3471 177.2498 204.3536 219.3897 267.0667 290.8147 340.1823 369.9642 379.0551 408.9643 430.5486 447.0093 485.8892 564.1863 584.3368 615.9014 706.3995 717.9958 733.6896 767.5329 773.7690 779.5445 827.7823 867.1132 871.8898 890.7368 904.8949 934.8907 953.9549 995.9346 1046.2574 1059.6375 1073.4056 1086.0891 1096.8166 1110.4174 1124.9742 1162.8038 1166.6120 1179.9974 1199.0179 1254.7279 1293.9668 1319.9660 1341.5803 1356.7062 1366.3716 1373.3806 1385.2478 1408.9650 1436.6640 1448.6687 1462.6926 1470.9431 1489.0506 1528.6008 1555.8639 1564.6734 2993.7448 3013.9755 3071.2945 3073.0915 3088.0635 3107.3226 3113.0224 3117.3058 3196.2516 3199.9662 3208.0011 3225.3902
redmass: 6.3087 4.3410 4.5245 2.8004 2.7706 8.1402 6.5899 4.3191 9.3910 4.6108 3.8575 1.3356 5.7189 2.2703 9.2226 5.1925 4.2566 4.7745 12.2391 5.1312 3.6643 6.1757 3.3261 5.6242 7.2197 3.8807 3.0216 4.2107 1.7608 1.1008 1.3499 3.2118 2.0300 2.1243 1.5150 3.6621 4.3536 2.5322 1.4555 1.7253 1.2435 1.7818 2.0241 1.2010 1.7243 1.6875 1.4765 3.4878 3.1642 1.6734 1.8058 4.5372 1.3175 3.6257 1.5794 2.5984 1.2403 3.8420 1.0874 1.1392 1.2716 1.0736 1.0528 8.8579 7.1493 6.8170 1.0361 1.0594 1.0879 1.1027 1.0994 1.0531 1.0999 1.0647 1.0939 1.0940 1.1171 1.1149
irintensity: 0.8042 0.2821 0.8236 0.7076 0.5731 2.2618 0.0509 0.9210 0.0741 0.7004 3.0292 2.6474 1.1243 1.9939 4.0391 15.3469 0.6596 2.6873 14.9576 9.8416 8.9730 0.0529 6.2565 6.3995 8.2543 26.5892 37.1654 132.6496 25.8090 1.0374 28.0294 6.7583 21.6093 0.3740 10.3580 0.2717 1.9559 4.7483 19.5378 18.2583 14.3416 1.9945 33.3699 3.5347 4.2751 58.5920 3.7159 4.7029 8.1716 23.3426 221.0054 71.8920 17.4228 68.8327 25.2323 48.5586 29.4710 116.7074 5.0787 20.3685 18.1166 16.8012 13.4793 322.3615 110.7818 70.2629 29.2976 27.0786 21.5119 8.1465 43.6306 9.9469 20.3211 8.7597 2.4991 0.6665 0.1725 14.4669
temp: 298.150 k
press: 1.00000 atm
elementType: 17 17 8 7 7 6 6 6 6 6 6 6 6 6 6 6 1 1 1 1 1 1 1 1 1 1 1 1
symmnumber: 1
zpe: 551531.5 jmol-1
zpe.correction: 0.210067 hartree
zpe.thermalcorrener: 0.226098 hartree
zpe.thermalcorrenthalpy: 0.227042 hartree
zpe.thermalcorrgfe: 0.164667 hartree
zpe.sumelectzpe: -1529.998940 hartree
zpe.sumelectthermal: -1529.982909 hartree
zpe.sumelectthermalent: -1529.981965 hartree
zpe.sumelectthermalfe: -1530.044340 hartree
dipole: -5.7726 2.5876 1.5680
dipole: 6.5175
quadrupole: -111.4105 -110.3523 -109.7997
quadrupole: -6.8555 -2.7861 -3.3798
quadrupole: -0.8897 0.1685 0.7211 -6.8555 -2.7861 -3.3798
hfenergy: -1530.2090072 hartree
pointgroup: C01 [X(C11H12Cl2N2O1)]
dipole: 2.217715 0.1632663 1.2767207 debye
polarizability: 190.3049742|-15.1324821|107.0853214|0.3277385|-21.3487355|166.5220453 unknown
InChI: InChI=1S/C11H12Cl2N2O/c1-2-15(8-3-4-8)11(16)7-5-9(12)14-10(13)6-7/h5-6,8H,2-4H2,1H3
charge 0 multiplicity 1
28 atoms
Cl -3.496113 1.741275 -2.433324
Cl -3.309223 -0.834325 2.3030
O  1.265506 -0.898288 -2.047135
N  2.012531 -0.439765 0.106376
N  -3.152689 0.413817 -0.098069
C  1.849583 0.089344 1.454242
C  2.73275 1.25578 1.933079
C  1.233915 1.471471 1.700042
C  3.348145 -0.99486 -0.267409
C  1.016604 -0.510432 -0.85861
C  4.188278 -0.046927 -1.148693
C  -0.411909 -0.142546 -0.506629
C  -1.159889 0.558428 -1.487005
C  -1.067305 -0.580314 0.671485
C  -2.516442 0.814167 -1.212631
C  -2.436328 -0.272707 0.803097
H  1.646001 -0.675936 2.215906
H  3.417459 1.709075 1.21237
H  3.109259 1.213015 2.958537
H  0.569817 1.583676 2.561316
H  0.944382 2.061145 0.826046
H  3.876249 -1.227655 0.67386
H  3.176851 -1.936414 -0.819039
H  3.651553 0.172894 -2.085655
H  4.415857 0.902313 -0.633045
H  5.147336 -0.532515 -1.406609
H  -0.694484 0.859989 -2.426953
H  -0.552996 -1.150806 1.445351
