program: Orca
programVersion: 4.2.1
elementType: Cl O N N N C C C C C C C C C C C C C C C H H H H H H H H H H H H H H H H H H
charge: 0
multiplicity: 1
keywords: wb97x-d3
keywords: def2-TZVPP
keywords: def2/J RIJCOSX GRIDX6 NOFINALGRIDX
keywords: grid4 nofinalgrid
keywords: scfconv7
keywords: smallprint printgap noloewdin
keywords: NOSOSCF
formula: C15H18ClN3O
InChI: InChI=1S/C15H18ClN3O/c1-11(12-2-3-12)15(20,8-19-10-17-9-18-19)13-4-6-14(16)7-5-13/h4-7,9-12,20H,2-3,8H2,1H3
38 atoms
Cl 4.060956 -3.578429 -0.149427
O  -0.07775 1.363055 -1.559665
N  -0.994943 2.720833 0.67158
N  -2.273325 2.814164 1.052522
N  -1.612392 4.718573 0.070045
C  -1.997449 -1.054715 0.641354
C  -2.590127 -0.584817 1.935105
C  -3.423402 -1.371877 0.971482
C  -1.700088 -0.118655 -0.508867
C  -0.31391 0.579379 -0.409347
C  -1.865859 -0.884571 -1.820353
C  -0.213211 1.516578 0.820741
C  0.803998 -0.446586 -0.334933
C  1.183382 -1.019079 0.878311
C  1.46235 -0.865761 -1.488727
C  2.180998 -1.97945 0.945099
C  2.460673 -1.827373 -1.440033
C  -0.62265 3.858231 0.082878
C  2.813539 -2.378123 -0.22008
C  -2.594336 4.024307 0.673797
H  -1.318784 -1.898471 0.717164
H  -2.81016 0.469782 2.039239
H  -2.263568 -1.06682 2.848103
H  -3.676318 -2.394617 1.219897
H  -4.197862 -0.843801 0.427341
H  -2.45406 0.67955 -0.493585
H  -1.188081 -1.738051 -1.879622
H  -1.702679 -0.265707 -2.702326
H  -2.882244 -1.273597 -1.886027
H  0.823999 1.826399 0.947937
H  -0.525467 1.030072 1.740216
H  -0.910392 1.736891 -1.867689
H  0.704546 -0.731617 1.804705
H  1.20213 -0.449092 -2.45073
H  2.456345 -2.406511 1.89948
H  2.95558 -2.137873 -2.350039
H  0.372998 4.024584 -0.295637
H  -3.580632 4.425524 0.846726
elementType: Cl O N C H
totalener: -1282.17223073 hartree
nucrepener: 1701.46284192 hartree
electener: -2983.63507266 hartree
oneelecener: -5130.88804149 hartree
twoeener: 2147.25296883 hartree
cpcmener: -0.02755403 hartree
kineticenergy: 1277.90581597 hartree
xcener: -101.892198296597 hartree
chargesum: 0.0000000
charge: -0.102649 -0.415656 0.151483 -0.381442 -0.421479 -0.172253 -0.177058 -0.201103 0.094495 0.537110 -0.349230 -0.235197 0.048885 -0.312376 -0.294770 -0.137355 -0.133220 0.049984 0.081865 0.079288 0.102638 0.094973 0.091813 0.095958 0.085184 0.063364 0.094370 0.098991 0.106843 0.145730 0.149785 0.235235 0.145810 0.147760 0.145720 0.145384 0.177257 0.163865
qa: -0.1026 -0.4157 0.1515 -0.3814 -0.4215 -0.1723 -0.1771 -0.2011 0.0945 0.5371 -0.3492 -0.2352 0.0489 -0.3124 -0.2948 -0.1374 -0.1332 0.0500 0.0819 0.0793 0.1026 0.0950 0.0918 0.0960 0.0852 0.0634 0.0944 0.0990 0.1068 0.1457 0.1498 0.2352 0.1458 0.1478 0.1457 0.1454 0.1773 0.1639
va: 1.2028 2.0297 3.3030 2.8504 3.0266 3.7662 3.8802 3.9718 3.7761 3.6323 3.9743 3.8852 3.3707 4.0375 4.0644 4.0208 3.9966 4.0674 3.8409 4.0117 1.0026 1.0405 1.0216 1.0167 1.0173 1.0315 0.9969 1.0129 1.0036 1.0049 0.9906 1.0036 1.0034 1.0270 1.0051 1.0058 1.0006 0.9926
dispcorr: -0.021224019 hartree
energy: -1282.193454750366
dipole: -23.41524 23.14426 -0.27099 3.56144 -4.18190 -0.62046 0.49473 -0.34060 0.15413
magnitude: 0.69438 au
magnitude: 1.76496 debye
