program: Gaussian 09
title: 000030171
version: EM64L-G09RevD.01
frameworkgroup: C1[X(C16H37NOSi)]
method: RPBEPBE
basis: SDD
operation: Freq
keyword: #p
keyword: freq=noraman
keyword: PBEPBE/SDD
title: #p freq=noraman PBEPBE/SDD
converged: YES YES NO NO
title: Mulliken charges:
elementType: Si O N C C C C C C C C C C C C C C C C H H H H H H H H H H H H H H H H H H H H H H H H H H H H H H H H H H H H H
charge: 1.429473 -0.597930 -0.110182 -0.770660 -0.770798 -0.789022 -0.386961 -0.257678 -0.361237 -0.362740 -0.669257 -0.669222 -0.682566 -0.356958 -0.352364 -0.341306 -0.340661 -0.694572 -0.694646 0.225685 0.228362 0.227240 0.228623 0.241614 0.242291 0.208424 0.215949 0.184778 0.204004 0.182402 0.199359 0.181135 0.200491 0.216520 0.230937 0.216420 0.231368 0.215889 0.217215 0.216865 0.216684 0.225870 0.206134 0.187705 0.204558 0.186202 0.190589 0.191532 0.191107 0.191636 0.211387 0.214301 0.210231 0.211554 0.214682 0.209544
chargesum: 0.00000
title: Mulliken charges with hydrogens summed into heavy atoms:
elementType: Si O N C C C C C C C C C C C C C C C C
charge: 1.429473 -0.597930 -0.110182 -0.316614 -0.314935 -0.305117 0.037412 0.131104 0.020524 0.018886 -0.005380 -0.004750 -0.023148 0.036880 0.038396 0.040815 0.042082 -0.058653 -0.058865
polarizability: 2.31858723e+02 -1.75999590e+00 2.21452208e+02 3.63244957e+00 3.88728629e+00 1.79000140e+02
1716.lowfreq: -5.4089 -0.4899 -0.0014 -0.0011 0.0004 8.4059 13.4575 17.0151 28.7476
frequency: 13.1280 15.1671 28.5140 33.9311 36.8873 45.5565 51.0847 56.6459 67.0798 74.3001 79.8906 97.0956 101.7695 111.1785 115.1532 126.3676 149.3601 149.5786 165.4733 173.3015 187.6919 202.9342 215.4678 222.8641 231.4164 234.2616 240.4930 268.3856 285.0138 293.6178 297.4364 334.6059 370.9341 382.5979 397.3253 441.3678 489.4247 503.8190 568.3398 640.9610 675.9358 686.2222 732.3998 734.5995 738.1364 742.5904 761.6283 790.1752 794.6113 797.7953 843.4453 897.6271 898.9993 927.0842 928.2431 947.1607 971.3131 980.5850 987.6009 990.5597 999.7942 1002.0104 1012.3757 1020.0429 1023.7493 1031.8461 1040.3978 1058.5136 1062.1831 1075.9433 1081.1929 1093.1614 1102.9608 1112.1840 1130.1305 1165.5340 1192.0107 1215.8862 1229.0628 1230.2216 1235.5308 1239.9793 1240.7632 1247.2072 1250.5723 1257.6365 1266.1856 1270.2455 1281.9529 1284.1700 1285.0093 1291.8744 1303.0989 1325.1678 1343.4211 1344.8578 1367.4280 1370.8650 1382.4528 1389.4148 1390.7500 1392.0798 1394.1679 1396.7163 1434.4239 1441.7977 1446.2630 1464.4594 1464.8322 1470.2038 1471.1696 1474.0216 1476.5982 1476.8987 1478.7409 1481.5487 1482.0587 1482.7122 1484.6010 1484.9217 1485.5808 1487.3066 1487.9856 1490.4787 1490.9967 2841.4615 2850.6558 2906.9355 2925.9197 2961.9567 2962.1493 2966.1964 2968.2617 2969.9193 2971.8579 2972.5242 2972.7072 2973.7748 2975.4107 2975.8173 2987.5447 2991.2975 3002.8058 3003.1321 3010.5506 3015.6829 3016.3731 3019.9223 3038.5529 3042.0560 3044.7371 3055.3368 3061.9197 3062.4056 3062.9656 3066.1142 3069.3393 3069.8672 3069.9511 3070.3963 3070.7950 3071.0371
redmass: 3.5465 3.5420 3.6148 3.4948 3.3134 2.6485 2.5981 2.4790 1.7074 2.0832 1.6155 2.5661 2.1276 2.8528 2.4019 2.0040 1.5739 2.5802 2.1767 2.2264 2.0172 2.8597 1.3473 1.4691 1.1785 1.1554 1.4474 2.8645 3.1529 3.2189 2.6556 2.8957 3.2565 3.1387 3.2203 3.0367 3.0270 3.0275 3.4753 2.3462 2.4858 1.5222 1.1029 1.0895 4.0064 1.3916 1.9012 1.1818 1.1844 1.1719 4.0799 1.7379 1.7430 1.2432 1.2290 1.1370 1.1597 1.2948 1.3863 1.4986 1.5873 3.0763 4.5411 2.9066 3.0589 3.3598 2.3919 2.3600 2.6907 2.4306 2.1910 2.6533 2.0092 2.2844 1.8391 1.4955 2.0477 1.3843 1.2559 1.2716 1.4548 1.3965 1.3653 1.4133 1.4288 1.3814 1.2740 1.3111 1.1241 1.0946 1.1087 1.2018 1.2741 1.3036 1.5020 1.5203 1.4035 1.3894 1.3813 1.2238 1.2319 1.1881 1.1844 1.1824 1.0765 1.0785 1.0770 1.0710 1.0720 1.0704 1.0701 1.0778 1.0450 1.0427 1.0698 1.0634 1.0502 1.0444 1.0445 1.0598 1.0503 1.0413 1.0648 1.0855 1.0885 1.0709 1.0707 1.0701 1.0581 1.0587 1.0587 1.0564 1.0470 1.0422 1.0382 1.0381 1.0377 1.0402 1.0594 1.0593 1.1013 1.0596 1.0954 1.0969 1.0903 1.0894 1.0991 1.0986 1.0992 1.1025 1.1017 1.0925 1.0997 1.0998 1.0999 1.0999 1.1006 1.1006 1.0998 1.0997 1.0994 1.0994
irintensity: 0.0308 0.1671 0.1236 0.0477 0.0419 0.0132 0.0386 0.0920 0.2297 0.2780 0.2016 0.3072 0.4424 0.2675 0.0246 0.4022 2.0215 0.4243 2.8014 3.1474 5.0509 0.8955 0.1171 0.3693 0.4584 0.1022 1.8761 1.2022 0.5006 2.9993 0.7876 2.0824 2.2362 16.8439 3.1548 11.1749 4.2046 4.3944 0.9090 8.7263 1.0241 18.6673 15.3787 3.4692 92.3886 50.7444 125.1088 1.9505 0.9618 1.7681 6.6130 15.4982 7.8345 9.0868 2.7197 2.2172 7.5091 1.1413 10.7207 12.6754 0.4529 13.4742 258.2047 55.0988 36.3090 24.2019 1.1731 28.5351 98.6397 12.1719 15.6325 7.0669 5.7426 0.6491 5.2893 4.9354 16.4192 4.3730 1.1934 0.2687 10.1323 6.8725 3.4741 14.7001 2.9092 12.9911 0.9565 2.7799 3.0520 1.0670 0.1113 10.0744 16.0403 2.7335 0.7637 0.7752 10.4313 4.3030 8.3525 5.3710 8.9456 11.3837 12.1421 5.0502 3.4594 23.2685 27.3898 0.4933 1.2382 0.6498 0.8737 1.7919 10.6212 12.3952 7.9696 2.5633 17.9590 4.7093 4.5785 5.2315 20.5981 8.6797 2.8357 6.4403 13.6471 40.2483 145.5818 64.4674 59.0756 19.5583 26.8090 16.4682 30.8230 59.5313 32.8997 22.7694 67.2857 2.3201 40.1826 65.2766 45.8166 13.9298 15.2732 7.4969 10.6613 11.3121 0.2410 27.5895 0.2935 36.6523 65.1172 43.9085 54.3743 57.5102 50.2318 24.2693 97.1790 117.7053 13.1303 84.7544 50.8745 43.2571
temp: 298.150 k
press: 1.00000 atm
elementType: 14 8 7 6 6 6 6 6 6 6 6 6 6 6 6 6 6 6 6 1 1 1 1 1 1 1 1 1 1 1 1 1 1 1 1 1 1 1 1 1 1 1 1 1 1 1 1 1 1 1 1 1 1 1 1 1
symmnumber: 1
zpe: 1320759.9 jmol-1
zpe.correction: 0.503051 hartree
zpe.thermalcorrener: 0.531481 hartree
zpe.thermalcorrenthalpy: 0.532425 hartree
zpe.thermalcorrgfe: 0.439158 hartree
zpe.sumelectzpe: -1049.661519 hartree
zpe.sumelectthermal: -1049.633089 hartree
zpe.sumelectthermalent: -1049.632145 hartree
zpe.sumelectthermalfe: -1049.725412 hartree
dipole: -0.1429 -0.6219 0.5003
dipole: 0.8109
quadrupole: -123.9198 -130.1188 -132.3641
quadrupole: 0.7555 -3.7733 0.0309
quadrupole: 4.8811 -1.3179 -3.5632 0.7555 -3.7733 0.0309
hfenergy: -1050.1645699 hartree
pointgroup: C01 [X(C16H37N1O1Si1)]
dipole: 0.0630849 -0.2481417 -0.1903161 debye
polarizability: 231.7624205|2.1601268|221.3303749|3.546143|-4.9384805|179.2182747 unknown
InChI: InChI=1S/C16H37NOSi/c1-6-11-13-17(14-12-7-2)15-16-18-19(8-3,9-4)10-5/h6-16H2,1-5H3
charge 0 multiplicity 1
56 atoms
Si 3.371285 -0.001496 -0.207789
O  1.817803 0.299671 0.556381
N  -1.908835 -0.090482 0.456489
C  3.5993 -1.89463 -0.444446
C  3.43562 0.887505 -1.910025
C  4.618235 0.728418 1.039352
C  -0.568504 0.282323 0.971375
C  0.533358 -0.049062 -0.049204
C  -2.978902 0.870758 0.824874
C  -2.264908 -1.508756 0.719193
C  3.529527 -2.699016 0.879041
C  3.212921 2.419273 -1.820902
C  6.099836 0.569474 0.609354
C  -2.94868 2.160407 -0.022287
C  -3.198592 -2.109704 -0.353282
C  -4.030458 3.180024 0.402764
C  -3.604951 -3.568136 -0.040568
C  -4.00311 4.468639 -0.447383
C  -4.531709 -4.174285 -1.116582
H  2.821357 -2.258478 -1.147249
H  4.569214 -2.076276 -0.951964
H  4.414291 0.670005 -2.385629
H  2.671621 0.434749 -2.575302
H  4.374521 1.798631 1.186839
H  4.449285 0.242562 2.020124
H  -0.323899 -0.220209 1.936576
H  -0.533727 1.369092 1.16487
H  0.499925 -1.129548 -0.313516
H  0.35665 0.532244 -0.978372
H  -2.932927 1.140436 1.911735
H  -3.955394 0.373392 0.669674
H  -2.732848 -1.633905 1.730069
H  -1.328203 -2.099156 0.737335
H  4.347616 -2.414733 1.567123
H  2.57683 -2.512349 1.408686
H  3.609843 -3.78729 0.697825
H  2.248997 2.653534 -1.332348
H  4.008255 2.909086 -1.228415
H  3.207319 2.887864 -2.822855
H  6.377282 -0.495022 0.488292
H  6.302843 1.076971 -0.353052
H  6.784075 1.004461 1.361222
H  -3.081599 1.884561 -1.086648
H  -1.950636 2.637916 0.055018
H  -2.686212 -2.057551 -1.333886
H  -4.113281 -1.489915 -0.446796
H  -5.031528 2.707453 0.32665
H  -3.890221 3.439446 1.472421
H  -2.692018 -4.191526 0.055181
H  -4.110187 -3.60506 0.946602
H  -4.170598 4.24121 -1.517038
H  -4.783716 5.183065 -0.12682
H  -3.023906 4.976816 -0.362948
H  -4.039658 -4.176512 -2.107445
H  -4.808377 -5.216833 -0.873558
H  -5.466223 -3.589056 -1.208954
