program: Gaussian 09
title: 000030117
version: EM64L-G09RevD.01
frameworkgroup: C1[X(C4H2Cl8)]
method: RPBEPBE
basis: SDD
operation: Freq
keyword: #pfreq=noraman
keyword: PBEPBE/SDD
title: #p freq=noraman PBEPBE/SDD
converged: YES YES NO NO
title: Mulliken charges:
elementType: Cl Cl Cl Cl Cl Cl Cl Cl C C C C H H
charge: 0.098932 0.165496 0.145230 0.152663 0.091049 0.096970 0.063970 0.113689 -0.255831 -0.310813 -0.551401 -0.531915 0.356617 0.365342
chargesum: 0.00000
title: Mulliken charges with hydrogens summed into heavy atoms:
elementType: Cl Cl Cl Cl Cl Cl Cl Cl C C C C
charge: 0.098932 0.165496 0.145230 0.152663 0.091049 0.096970 0.063970 0.113689 -0.255831 -0.310813 -0.194784 -0.166573
polarizability: 1.27436766e+02 3.28096389e+00 1.17680292e+02 4.87781374e+00 -8.95636773e+00 1.11009974e+02
1716.lowfreq: -6.8157 -0.0033 -0.0023 -0.0015 3.1994 4.9935 45.7538 52.7289 87.8424
frequency: 45.7347 52.7256 87.8379 116.1340 141.7612 158.6634 172.0072 190.5714 199.0057 211.5615 213.5922 222.5214 248.2185 258.6867 303.0982 315.5358 327.6045 339.1116 534.6350 546.5468 610.0028 650.4721 670.1476 699.7555 724.3082 768.3483 793.5138 912.4955 1019.4987 1035.6598 1178.0298 1188.1329 1243.5984 1260.3143 3142.6057 3150.8291
redmass: 22.9888 26.7469 30.6475 28.4250 30.6564 29.8105 30.1387 26.5755 30.2648 29.6919 29.3351 33.9862 26.1788 25.7408 21.8453 22.0006 29.2110 28.5134 9.2636 8.9064 10.7683 10.5532 11.8644 9.3843 7.5865 8.9524 6.3043 10.4154 10.6077 8.3260 1.0720 1.0749 1.1589 1.1425 1.0872 1.0869
irintensity: 0.2440 0.0768 0.2994 0.3825 0.3857 0.5239 0.8645 0.5956 0.0486 0.0410 0.2656 0.0139 0.1236 0.4903 1.6458 2.5903 0.9419 1.5166 44.3035 43.8939 80.7370 81.8312 128.7125 27.9743 12.0720 30.7109 28.4893 19.0419 7.3539 3.7790 7.9394 3.7397 1.2390 6.9770 1.1306 7.6100
temp: 298.150 k
press: 1.00000 atm
elementType: 17 17 17 17 17 17 17 17 6 6 6 6 1 1
symmnumber: 1
zpe: 141956.5 jmol-1
zpe.correction: 0.054068 hartree
zpe.thermalcorrener: 0.068587 hartree
zpe.thermalcorrenthalpy: 0.069531 hartree
zpe.thermalcorrgfe: 0.010728 hartree
zpe.sumelectzpe: -3833.121276 hartree
zpe.sumelectthermal: -3833.106757 hartree
zpe.sumelectthermalent: -3833.105813 hartree
zpe.sumelectthermalfe: -3833.164616 hartree
dipole: 0.6180 -0.1234 -1.3978
dipole: 1.5333
quadrupole: -130.1756 -126.0638 -122.0390
quadrupole: 0.9149 -0.9948 0.2458
quadrupole: -4.0828 0.0290 4.0538 0.9149 -0.9948 0.2458
hfenergy: -3833.1753443 hartree
pointgroup: C01 [X(C4H2Cl8)]
dipole: -0.2426975 0.0660832 -0.5483007 debye
dipolederiv: -0.2178987 -0.0015359 -0.0065871 -0.0276811 -0.2042113 -0.2119042 -0.0442473 -0.1156401 -0.6171192 -0.2133262 0.1359449 -0.1637273 0.1356779 -0.2357594 0.2191711 -0.139719 0.1872156 -0.2894825 -0.2133578 -0.1549902 -0.0263277 -0.1665092 -0.5800785 -0.0409681 -0.0075913 0.0321569 -0.1118684 -0.1181345 0.0471964 0.0929664 0.0162664 -0.147039 -0.1471903 0.0231774 -0.1994284 -0.448705 -0.1349756 -0.0552952 -0.0233065 0.0045108 -0.2731626 -0.2437448 0.0816439 -0.2492113 -0.3852685 -0.5741981 0.0364869 0.2292157 0.0430581 -0.1281363 -0.0619491 0.1607163 -0.0534874 -0.1685013 -0.3245814 -0.1020342 0.0054632 -0.2144732 -0.5608913 0.143306 0.0103861 0.1099096 -0.101173 -0.6210896 -0.0562288 0.0224187 -0.0111068 -0.1179432 0.0365506 0.0675554 0.0492619 -0.0612944 0.3814238 -0.1438983 0.1819718 -0.0744863 0.3809173 -0.0674686 0.1760716 -0.1764168 0.8852234 0.341721 0.0484202 -0.0860506 0.0773325 0.6493113 0.3155863 -0.0480168 0.211765 0.596688 0.6806113 0.0735745 -0.2551433 0.0425346 0.4407556 0.3701891 -0.2499969 0.4344594 0.5465972 0.8590068 0.1985396 -0.0106382 0.2618057 0.7818166 -0.2748908 -0.0511255 -0.2113056 0.113801 0.1150974 -0.0144232 0.0023191 -0.0525661 0.0027577 -0.0383331 0.012248 -0.045422 0.0021604 0.0397015 -0.0117567 0.0374257 -0.0343632 -0.0083367 0.0016458 0.0088982 0.0261433 0.0389422 unknown
polarizability: 127.2941183|3.7123723|117.0778058|-4.9000753|9.1035488|111.7551069 unknown
InChI: InChI=1S/C4H2Cl8/c5-1(6)3(9,10)4(11,12)2(7)8/h1-2H
charge 0 multiplicity 1
14 atoms
Cl 0.801463 -1.262442 -1.840612
Cl 1.559365 -1.656381 1.098001
Cl -1.484211 -2.180247 0.234747
Cl -1.088426 0.242377 1.96809
Cl 1.722204 1.773064 1.35248
Cl 3.327547 0.409178 -0.790259
Cl -1.229494 2.171408 -0.902002
Cl -3.498553 0.277897 -0.342983
C  0.739254 -0.501582 -0.091769
C  -0.813936 -0.409215 0.257597
C  1.595321 0.799045 -0.217077
C  -1.699612 0.362454 -0.765235
H  1.171088 1.468238 -0.973474
H  -1.585111 -0.065694 -1.768901
