program: Gaussian 09
title: 000030187
version: EM64L-G09RevD.01
frameworkgroup: C1[X(C14H14N6O4S)]
method: RPBEPBE
basis: SDD
operation: Freq
keyword: #p
keyword: freq=noraman
keyword: PBEPBE/SDD
title: #p freq=noraman PBEPBE/SDD
converged: YES YES NO NO
title: Mulliken charges:
elementType: S O O O O N N N N N N C C C C C C C C C C C C C C H H H H H H H H H H H H H H
charge: 0.872530 -0.532802 -0.532389 -0.200352 -0.199639 0.025573 -0.312762 -0.631474 -0.195033 -0.621310 -0.631057 -0.099108 -0.086173 -0.240182 -0.224851 -0.202686 -0.201419 -0.379694 -0.378755 -0.338043 -0.336620 0.391684 0.304148 0.185836 0.250433 0.275814 0.275459 0.289313 0.289210 0.278243 0.255127 0.294988 0.295218 0.335427 0.340407 0.344291 0.313993 0.427465 0.299187
chargesum: 0.00000
title: Mulliken charges with hydrogens summed into heavy atoms:
elementType: S O O O O N N N N N N C C C C C C C C C C C C C C
charge: 0.872530 -0.532802 -0.532389 -0.200352 -0.199639 0.025573 -0.312762 0.044360 -0.195033 0.036974 0.095596 -0.099108 -0.086173 0.035632 0.050608 0.086626 0.087791 -0.101450 -0.123628 -0.043056 -0.041402 0.391684 0.304148 0.185836 0.250433
polarizability: 4.42199864e+02 4.14356978e+00 2.05573626e+02 -5.10343033e+00 -2.14272275e+01 2.08311995e+02
1716.lowfreq: -4.3464 -0.0021 -0.0014 -0.0010 2.1066 7.3013 14.9504 21.8743 24.5175
frequency: 14.9186 21.7717 24.4981 43.6888 55.9325 67.3243 68.8350 88.6451 100.3968 120.1249 142.7055 154.8385 163.7160 198.0604 199.8919 224.4356 261.3501 266.8693 289.0230 294.4519 316.7860 339.1617 362.8791 388.3582 402.3983 410.8412 413.7070 421.8197 432.1952 464.2529 479.2644 483.8686 499.9474 505.8369 521.6650 535.5798 539.6577 546.2697 599.9457 613.3919 617.3946 664.4321 679.3542 684.4999 701.3534 711.3544 722.2777 737.5625 777.3320 791.0703 794.2634 839.9922 857.2719 858.8720 874.2074 878.1454 924.3175 937.8890 963.1640 976.8603 982.8763 991.2368 995.4230 997.9868 999.4725 1032.5310 1044.4124 1050.7717 1084.0090 1086.1025 1102.2352 1111.1485 1167.5559 1169.2804 1176.4809 1216.4073 1276.6452 1278.3897 1285.4956 1351.1330 1367.1571 1392.5209 1406.4637 1420.6340 1421.4024 1451.3187 1454.8502 1473.5479 1521.3928 1535.3883 1564.8326 1580.0095 1582.5993 1600.4151 1606.3185 1609.1562 1647.6599 2960.3609 3139.4475 3146.2942 3157.5710 3158.8866 3159.1539 3167.3338 3186.0881 3188.1715 3544.1945 3559.7053 3605.4812 3698.9995 3713.9502
redmass: 9.0426 4.9136 5.7848 6.4750 5.3362 6.1611 4.3528 7.7340 6.9924 7.4359 6.5228 7.1030 8.6242 7.7526 9.0553 10.3157 5.6251 7.0423 1.2600 3.9286 5.5103 4.8589 5.4144 7.5560 5.2938 2.8746 2.7843 6.9729 3.4918 1.2160 1.8399 2.0587 3.4269 7.2687 2.9451 2.8298 1.2710 1.2553 6.0106 7.0761 6.8666 4.8640 8.5117 8.0004 5.8888 8.0154 3.8444 4.3165 11.4659 9.4437 4.6935 1.2398 1.2443 1.7650 1.7326 3.3274 16.8092 1.0947 1.3438 1.3999 3.9630 1.4169 4.4946 2.6239 1.3748 1.8428 2.3500 2.4157 1.7294 4.0113 1.2760 1.3116 1.2345 1.8351 1.1811 8.5095 3.3141 1.2758 1.3127 4.6892 6.5646 5.5558 3.8611 3.8924 5.2060 2.1902 2.5204 2.2071 3.0837 3.3743 7.3327 5.6842 5.4592 1.3053 8.3333 1.7403 2.1159 1.0743 1.0874 1.0879 1.0927 1.0934 1.0914 1.0971 1.0948 1.0961 1.0441 1.0453 1.0840 1.1053 1.1052
irintensity: 0.3367 0.1835 0.1894 0.6652 0.4995 0.1489 3.7512 3.2035 2.6806 5.9938 8.5777 10.3293 3.6732 8.4680 7.7673 0.9666 10.9429 0.6220 27.0499 6.0619 7.3752 31.2594 9.0216 6.7034 32.8461 0.2356 5.4102 37.8334 4.4048 44.6215 196.8344 355.3840 49.2441 1.0805 120.5155 32.2915 42.6095 78.0782 38.7416 0.3066 3.3205 29.7642 41.8204 12.1618 0.1707 43.8072 3.8292 4.9575 79.3788 21.5632 71.9524 2.6739 1.2400 60.4284 15.4065 29.3038 68.8843 137.5766 5.8547 0.1424 3.5506 2.0708 8.9064 10.8920 0.0071 11.0402 52.2241 56.9002 8.8283 8.9065 5.6214 18.0459 11.7477 9.7768 87.0009 410.0001 217.8588 6.7302 6.3026 23.8326 53.4454 56.7056 63.8205 97.6560 46.5559 3.7488 323.9100 363.6012 309.8955 1476.1633 50.1179 160.9297 136.3881 229.4327 2.9705 309.6572 1023.1601 812.3111 1.8759 1.1785 4.4432 1.9572 5.3770 8.1914 1.9174 0.8293 47.7707 127.0445 45.8929 50.9503 40.5652
temp: 298.150 k
press: 1.00000 atm
elementType: 16 8 8 8 8 7 7 7 7 7 7 6 6 6 6 6 6 6 6 6 6 6 6 6 6 1 1 1 1 1 1 1 1 1 1 1 1 1 1
symmnumber: 1
zpe: 732663.8 jmol-1
zpe.correction: 0.279057 hartree
zpe.thermalcorrener: 0.302851 hartree
zpe.thermalcorrenthalpy: 0.303795 hartree
zpe.thermalcorrgfe: 0.222860 hartree
zpe.sumelectzpe: -1567.338002 hartree
zpe.sumelectthermal: -1567.314208 hartree
zpe.sumelectthermalent: -1567.313264 hartree
zpe.sumelectthermalfe: -1567.394199 hartree
dipole: 11.1675 -3.4816 -0.9244
dipole: 11.7340
quadrupole: -116.8659 -180.9635 -145.3560
quadrupole: -11.6446 -10.8648 -11.2207
quadrupole: 30.8626 -33.2350 2.3724 -11.6446 -10.8648 -11.2207
hfenergy: -1567.6170591 hartree
pointgroup: C01 [X(C14H14N6O4S1)]
dipole: 4.3271988 1.6023962 0.1414391 debye
polarizability: 441.7331585|7.8161982|197.1926021|10.2820923|-18.6376352|217.1597244 unknown
InChI: InChI=1S/C14H14N6O4S/c15-13(16)19-14(17)18-9-1-5-11(6-2-9)25(23,24)12-7-3-10(4-8-12)20(21)22/h1-8H,15-17H2
charge 0 multiplicity 1
39 atoms
S  -1.607961 -2.339386 0.258049
O  -1.717236 -3.186244 -1.140574
O  -1.817375 -2.998691 1.743287
O  -6.307635 2.363523 -1.356793
O  -6.388151 2.512597 0.917941
N  -5.923994 2.010767 -0.176287
N  3.82953 0.395874 0.353338
N  3.57264 1.969902 -1.460043
N  5.658597 1.696723 -0.524442
N  7.849283 1.643761 0.224652
N  6.248531 0.268406 1.314339
C  0.043738 -1.448325 0.259095
C  -2.926434 -0.966225 0.123076
C  0.69433 -1.241128 -0.969642
C  0.610025 -1.090095 1.496761
C  -3.367012 -0.598322 -1.158865
C  -3.446497 -0.430564 1.312738
C  1.946476 -0.597296 -0.962209
C  1.86313 -0.45318 1.492385
C  -4.364436 0.393363 -1.259744
C  -4.444101 0.56142 1.214788
C  -4.875707 0.9596 -0.070409
C  2.552276 -0.174978 0.268982
C  4.333013 1.298986 -0.5152
C  6.553526 1.183873 0.345364
H  0.24723 -1.609247 -1.899528
H  0.092022 -1.329885 2.43144
H  -2.95922 -1.098365 -2.043315
H  -3.098025 -0.80367 2.281148
H  2.489967 -0.466671 -1.904068
H  2.340673 -0.158958 2.432117
H  -4.752568 0.726537 -2.225469
H  -4.890768 1.020409 2.10031
H  4.039889 2.686884 -2.009962
H  2.563482 1.856049 -1.509834
H  8.028862 2.326751 -0.506977
H  8.608057 1.314802 0.814322
H  5.226523 0.002351 1.30187
H  6.93412 -0.095047 1.972958
