program: Gaussian 09
title: 000030131
version: EM64L-G09RevD.01
frameworkgroup: C1[X(C17H23NO2)]
method: RPBEPBE
basis: SDD
operation: Freq
keyword: #p
keyword: freq=noraman
keyword: PBEPBE/SDD
title: #p freq=noraman PBEPBE/SDD
converged: NO YES NO NO
title: Mulliken charges:
elementType: O O N C C C C C C C C C C C C C C C C C H H H H H H H H H H H H H H H H H H H H H H H
charge: -0.265740 -0.248790 -0.080946 0.056857 -0.145542 -0.515020 -0.478583 0.426306 -0.212373 0.191190 -0.201684 -0.325763 -0.407555 -0.635953 -0.635532 -0.266880 -0.251284 -0.245867 -0.225518 -0.677125 0.262963 0.220417 0.229556 0.208954 0.232592 0.209484 0.202097 0.236473 0.246972 0.206276 0.210146 0.239225 0.223130 0.194172 0.224549 0.222617 0.220639 0.224932 0.228788 0.229877 0.212369 0.233552 0.226023
chargesum: 0.00000
title: Mulliken charges with hydrogens summed into heavy atoms:
elementType: O O N C C C C C C C C C C C C C C C C C
charge: -0.265740 -0.248790 -0.080946 0.056857 0.117421 -0.065048 -0.037037 0.426306 -0.002889 0.191190 0.000413 -0.089289 -0.160582 0.019694 0.006320 -0.044263 -0.030645 -0.020936 0.233146 -0.005181
polarizability: 1.87586088e+02 -1.53176471e+01 2.09369397e+02 1.49872838e+01 8.21335517e-01 1.72417639e+02
1716.lowfreq: -17.4913 -12.9320 -6.3191 -0.0009 -0.0008 -0.0005 24.6175 27.0780 50.6982
frequency: 24.4409 26.5310 50.4346 62.0195 67.0766 75.2241 90.3980 112.3272 132.5330 157.2462 173.6400 196.6940 204.7985 227.8840 232.7760 257.8502 261.3936 278.1035 300.9295 325.8220 338.0669 352.3424 386.7083 400.6812 413.5959 452.2926 494.0350 512.7992 541.2342 574.8527 616.7127 668.7523 687.1511 694.7720 705.2679 721.7295 772.0378 777.9439 798.6594 803.8820 845.7396 851.2353 874.2477 903.3231 907.4072 931.0204 969.2985 971.3890 976.8072 982.6207 991.0361 991.7215 1021.3087 1027.5238 1032.3807 1043.2292 1061.1396 1078.9133 1081.2229 1087.4741 1109.3672 1117.3377 1126.9667 1133.8927 1134.8307 1171.9615 1182.2837 1185.9854 1197.6771 1209.1556 1225.0616 1246.9082 1254.3613 1260.3755 1306.9554 1320.3912 1321.8458 1346.8344 1352.6457 1366.7602 1380.0549 1384.3734 1399.6347 1417.7113 1433.3337 1441.7011 1456.9114 1461.3800 1463.4580 1464.0551 1466.9794 1473.2483 1483.6490 1486.0900 1487.3990 1493.4614 1589.5081 1603.1300 1612.4304 1671.5732 2862.4719 2885.0663 2964.0476 2980.7450 2994.8936 3005.1049 3005.3277 3010.2833 3021.6133 3025.2303 3065.4826 3068.7784 3073.4308 3079.7835 3085.5847 3091.3152 3106.8893 3117.2613 3119.7892 3129.4344 3144.9003 3154.4340 3164.7940
redmass: 3.4555 3.6077 3.5881 2.5121 2.5336 4.3564 5.3753 2.9031 3.6751 3.0005 2.3234 1.5700 2.3320 1.1549 2.3076 2.3641 1.9095 4.8467 3.4875 3.0342 2.8717 3.3272 3.4456 2.8265 2.6838 3.2899 3.6050 2.6645 4.1696 4.6667 6.2895 3.3865 3.9326 3.0975 1.7889 2.0011 2.0913 2.6412 1.1246 3.4502 1.3361 3.3199 3.9256 1.9514 2.6233 2.0121 1.8506 1.4825 2.5238 1.7894 1.6170 3.2653 2.2385 2.4606 2.1424 1.6312 2.5365 1.7925 1.6524 1.3176 2.2585 2.0954 2.4676 1.4393 1.4894 1.0555 2.3799 2.1922 1.1346 1.7702 1.8345 1.1387 1.6777 1.7219 1.3556 1.5885 1.3646 1.4151 1.3679 1.3498 4.8891 1.7192 1.2641 1.1413 2.2150 1.1482 1.0782 1.0772 1.0404 1.0855 1.0688 1.0632 2.0699 1.0668 1.0543 1.0507 6.0312 8.3662 7.1729 6.6747 1.0557 1.0544 1.0624 1.0820 1.0358 1.0735 1.0821 1.0582 1.0759 1.0741 1.1005 1.1065 1.1005 1.1010 1.0834 1.0986 1.1026 1.0987 1.0843 1.0883 1.0929 1.0952 1.0999
irintensity: 0.6038 0.1328 0.1972 0.6356 0.6848 0.8326 0.0587 0.9389 0.9660 3.0783 0.8111 1.1368 1.0939 0.5370 2.0688 1.3198 1.0626 4.5947 2.3144 6.6275 13.4658 13.4361 2.1700 0.3830 2.6041 2.6783 5.1335 11.5045 4.3861 5.7256 0.1956 31.7922 2.6730 21.5951 40.2570 25.6086 26.5914 2.3062 2.3870 2.7093 1.1411 10.8792 2.9222 3.7300 10.0278 3.4531 12.9528 7.0478 2.0891 17.8518 2.0947 0.4174 16.6671 162.3234 57.1763 40.1998 25.4804 20.3626 14.8561 9.3506 22.2334 8.4038 190.8878 10.6762 15.0214 0.0971 0.7096 32.9443 1.9267 32.6857 7.3712 0.0534 10.0487 2.9213 2.5298 0.7383 2.5146 1.0457 2.1979 1.3941 0.1753 1.9647 25.8866 6.2963 10.3754 4.4997 7.8473 2.7654 11.9945 10.4482 12.5930 6.0136 20.9604 11.9263 10.6355 19.9717 3.9942 88.7356 43.2899 4.9980 127.9091 124.9853 37.9593 5.9715 20.8982 31.5272 17.6958 19.4188 21.9269 56.3285 22.2027 6.2992 68.9227 3.2847 10.8420 30.1708 39.9096 63.8796 0.3783 9.3436 30.4409 29.8590 13.9674
temp: 298.150 k
press: 1.00000 atm
elementType: 8 8 7 6 6 6 6 6 6 6 6 6 6 6 6 6 6 6 6 6 1 1 1 1 1 1 1 1 1 1 1 1 1 1 1 1 1 1 1 1 1 1 1
symmnumber: 1
zpe: 951025.3 jmol-1
zpe.correction: 0.362226 hartree
zpe.thermalcorrener: 0.382820 hartree
zpe.thermalcorrenthalpy: 0.383764 hartree
zpe.thermalcorrgfe: 0.312079 hartree
zpe.sumelectzpe: -865.254737 hartree
zpe.sumelectthermal: -865.234144 hartree
zpe.sumelectthermalent: -865.233200 hartree
zpe.sumelectthermalfe: -865.304885 hartree
dipole: 0.9358 -0.3209 1.4734
dipole: 1.7747
quadrupole: -107.8160 -114.8237 -119.1309
quadrupole: 0.9483 2.5492 -1.7400
quadrupole: 6.1075 -0.9001 -5.2074 0.9483 2.5492 -1.7400
hfenergy: -865.6169636 hartree
pointgroup: C01 [X(C17H23N1O2)]
dipole: 0.1146209 -0.3451794 0.5959982 debye
polarizability: 186.6215247|15.2423683|209.1171046|9.1500912|-12.9068121|173.6344948 unknown
InChI: InChI=1S/C17H23NO2/c1-4-20-16(19)17(14-10-6-5-7-11-14)13-9-8-12-15(17)18(2)3/h5-8,10-12,15H,4,9,13H2,1-3H3
charge 0 multiplicity 1
43 atoms
O  1.445109 -2.007341 0.084114
O  0.412514 -1.43308 -1.908904
N  -2.153755 1.397944 -0.409907
C  -0.271162 -0.267992 0.200855
C  -1.639856 0.005187 -0.550076
C  -0.50449 -0.850696 1.625752
C  -1.347607 -2.142907 1.616641
C  0.628892 0.997337 0.207252
C  -2.688779 -1.055211 -0.220664
C  0.518229 -1.28913 -0.667204
C  -2.569186 -2.014728 0.7327
C  0.893467 1.668986 -1.015514
C  1.221511 1.499994 1.391309
C  -2.59166 1.817997 0.932158
C  -3.088444 1.78737 -1.481942
C  1.723643 2.807243 -1.053525
C  2.050906 2.645905 1.357673
C  2.306748 3.304991 0.136023
C  2.353926 -2.911026 -0.688573
C  3.267619 -3.588205 0.327223
H  -1.406477 -0.103255 -1.628459
H  -1.027788 -0.09056 2.232956
H  0.46527 -1.058994 2.108102
H  -1.65499 -2.387685 2.65259
H  -0.725843 -2.997963 1.278235
H  -3.602416 -1.013878 -0.830515
H  -3.377351 -2.747082 0.872394
H  0.451097 1.293115 -1.944245
H  1.046677 1.006083 2.351466
H  -3.397823 1.180712 1.369229
H  -2.96785 2.855217 0.872719
H  -1.733987 1.823757 1.627172
H  -3.238412 2.88275 -1.454732
H  -4.097765 1.309992 -1.418217
H  -2.65353 1.52834 -2.464634
H  1.913906 3.308386 -2.009473
H  2.497414 3.018295 2.287029
H  2.951571 4.190801 0.108767
H  1.732896 -3.630802 -1.251758
H  2.910506 -2.293652 -1.416741
H  3.971551 -4.261788 -0.194895
H  3.853665 -2.840838 0.888716
H  2.684155 -4.187188 1.047506
