program: Orca
programVersion: 4.2.1
elementType: Br Cl Cl O N N N C C C C C C C C C C C C C H H H H H H H H H H H H
charge: 0
multiplicity: 1
keywords: wb97x-d3
keywords: def2-TZVPP
keywords: def2/J RIJCOSX GRIDX6 NOFINALGRIDX
keywords: grid4 nofinalgrid
keywords: scfconv7
keywords: smallprint printgap noloewdin
keywords: NOSOSCF
formula: C13H12BrCl2N3O
InChI: InChI=1S/C13H12BrCl2N3O/c14-9-4-13(20-5-9,6-19-8-17-7-18-19)11-2-1-10(15)3-12(11)16/h1-3,7-9H,4-6H2
32 atoms
Br 0.373963 -2.873647 0.63158
Cl 0.579156 2.011217 1.887322
Cl 5.176845 1.256199 -0.686784
O  -1.13006 -0.630876 -1.430984
N  -2.927555 1.548956 -0.470173
N  -3.741975 0.887052 -1.293796
N  -4.910776 1.835954 0.364408
C  -0.791068 0.245896 -0.373157
C  -1.242505 -0.487393 0.910367
C  -1.355255 -1.937415 0.481653
C  -1.499028 1.587392 -0.654412
C  -1.779462 -1.792975 -0.959345
C  0.715115 0.508039 -0.410324
C  1.39337 1.280503 0.533248
C  1.482429 -0.016995 -1.447323
C  2.758521 1.514586 0.460927
C  2.845279 0.199379 -1.548014
C  -3.637956 2.108289 0.514144
C  3.475727 0.967785 -0.586464
C  -4.917781 1.0858 -0.754407
H  -2.240434 -0.162131 1.216264
H  -0.592686 -0.337528 1.76646
H  -2.063029 -2.507643 1.080072
H  -1.28512 1.880282 -1.682835
H  -1.123966 2.380065 -0.012613
H  -1.520454 -2.634507 -1.60171
H  -2.868739 -1.668754 -0.991036
H  1.005207 -0.623567 -2.202193
H  3.249017 2.114994 1.214207
H  3.402188 -0.231154 -2.368578
H  -3.190852 2.699445 1.298475
H  -5.817922 0.678721 -1.188179
elementType: Br Cl O N C H
totalener: -4236.79397664 hartree
nucrepener: 2329.65206645 hartree
electener: -6566.44604308 hartree
twoeener: 3932.29681496 hartree
cpcmener: -0.02265698 hartree
kineticenergy: 4228.67585605 hartree
xcener: -184.140291311893 hartree
chargesum: 0.0000000
charge: -0.167832 -0.088823 -0.085004 -0.377853 0.119030 -0.355763 -0.407002 0.396372 -0.231578 0.061771 -0.170104 -0.009471 -0.000435 -0.058248 -0.158061 -0.143293 -0.165393 0.064392 0.104351 0.081041 0.122919 0.112842 0.138452 0.134234 0.140413 0.102604 0.095942 0.147470 0.123990 0.144465 0.166689 0.161885
qa: -0.1678 -0.0888 -0.0850 -0.3779 0.1190 -0.3558 -0.4070 0.3964 -0.2316 0.0618 -0.1701 -0.0095 -0.0004 -0.0582 -0.1581 -0.1433 -0.1654 0.0644 0.1044 0.0810 0.1229 0.1128 0.1385 0.1342 0.1404 0.1026 0.0959 0.1475 0.1240 0.1445 0.1667 0.1619
va: 1.1030 1.2340 1.2191 1.9767 3.3473 2.8668 3.0296 3.6921 3.9380 3.9688 3.8816 3.9863 3.4362 3.9877 3.9453 4.0667 4.0440 4.0565 3.8650 4.0148 1.0184 1.0323 0.9964 1.0165 1.0193 1.0061 1.0038 1.0276 1.0225 1.0061 0.9977 0.9945
dispcorr: -0.020189799 hartree
energy: -4236.814166435246
dipole: -23.50090 23.50616 0.00526 23.80193 -23.70167 0.10026 -10.75972 11.00094 0.24122
magnitude: 0.26128 au
magnitude: 0.66411 debye
