program: Orca
programVersion: 4.2.1
elementType: Br Cl Cl O N N N C C C C C C C C C C C C C H H H H H H H H H H H H
charge: 0
multiplicity: 1
keywords: wb97x-d3
keywords: def2-TZVPP
keywords: def2/J RIJCOSX GRIDX6 NOFINALGRIDX
keywords: grid4 nofinalgrid
keywords: scfconv7
keywords: smallprint printgap noloewdin
keywords: NOSOSCF
formula: C13H12BrCl2N3O
InChI: InChI=1S/C13H12BrCl2N3O/c14-9-4-13(20-5-9,6-19-8-17-7-18-19)11-2-1-10(15)3-12(11)16/h1-3,7-9H,4-6H2
32 atoms
Br -1.534771 -3.250415 1.03699
Cl 1.135176 1.730987 2.021076
Cl 5.595415 1.640668 -0.891695
O  -0.70837 -0.294047 -1.615496
N  -2.526555 1.53055 -0.477927
N  -3.199292 1.483436 0.67728
N  -4.567099 1.036561 -1.041397
C  -0.316572 0.42701 -0.457479
C  -0.688435 -0.482606 0.744488
C  -1.562666 -1.548108 0.102401
C  -1.10537 1.746329 -0.508033
C  -0.972279 -1.642113 -1.290719
C  1.173027 0.741901 -0.52823
C  1.892561 1.32061 0.5170
C  1.879161 0.471334 -1.697608
C  3.246611 1.600477 0.414659
C  3.231034 0.73797 -1.82546
C  -3.358749 1.254453 -1.493037
C  3.911006 1.302295 -0.76115
C  -4.41645 1.184951 0.291371
H  -1.20422 0.050368 1.539365
H  0.209346 -0.93487 1.167404
H  -2.608484 -1.239015 0.063283
H  -0.852607 2.271866 -1.430476
H  -0.847643 2.3931 0.327099
H  -0.054575 -2.243319 -1.290893
H  -1.659155 -2.050211 -2.031829
H  1.355043 0.034704 -2.535011
H  3.773061 2.044566 1.247333
H  3.747985 0.507793 -2.74623
H  -3.043934 1.230627 -2.524267
H  -5.226889 1.080083 0.995412
totalener: -4236.77244660 hartree
nucrepener: 2272.52847265 hartree
electener: -6509.30091925 hartree
twoeener: 3874.77264372 hartree
kineticenergy: 4228.68270502 hartree
xcener: -184.139255303859 hartree
chargesum: 0.0000000
charge: -0.097827 -0.061200 -0.062093 -0.371781 0.121101 -0.326158 -0.324019 0.434636 -0.277426 0.020536 -0.158149 -0.030669 -0.039964 -0.097154 -0.131816 -0.124552 -0.154527 0.031116 0.094101 0.059394 0.122260 0.119343 0.119107 0.126416 0.142320 0.093505 0.108848 0.141632 0.117187 0.126356 0.145162 0.134315
qa: -0.0978 -0.0612 -0.0621 -0.3718 0.1211 -0.3262 -0.3240 0.4346 -0.2774 0.0205 -0.1581 -0.0307 -0.0400 -0.0972 -0.1318 -0.1246 -0.1545 0.0311 0.0941 0.0594 0.1223 0.1193 0.1191 0.1264 0.1423 0.0935 0.1088 0.1416 0.1172 0.1264 0.1452 0.1343
va: 1.1748 1.2663 1.2434 1.9804 3.3284 2.8269 3.0526 3.6483 3.9039 4.0934 3.8326 3.9842 3.4800 4.0718 3.9484 4.0478 4.0532 4.0783 3.9421 4.0327 1.0333 1.0223 1.0054 1.0071 1.0328 1.0019 1.0016 1.0286 1.0241 1.0140 1.0097 1.0020
dispcorr: -0.019873022 hartree
energy: -4236.792319622044
dipole: -0.88613 1.74384 0.85771 28.62470 -28.35652 0.26818 -17.94535 17.27770 -0.66765
magnitude: 1.11953 au
magnitude: 2.84563 debye
