program: Gaussian 09
title: 000030133
version: EM64L-G09RevD.01
frameworkgroup: C1[X(C16H15NO2)]
method: RPBEPBE
basis: SDD
operation: Freq
keyword: #p
keyword: freq=noraman
keyword: PBEPBE/SDD
title: #p freq=noraman PBEPBE/SDD
converged: YES YES NO NO
title: Mulliken charges:
elementType: O O N C C C C C C C C C C C C C C C C H H H H H H H H H H H H H H H
charge: -0.460562 -0.503765 -0.257743 -0.260205 0.022073 -0.677198 0.335788 0.229333 -0.538923 0.434335 -0.469806 0.071134 -0.409941 -0.390504 0.033344 -0.480926 -0.264639 0.136121 -0.374751 0.247441 0.252402 0.217054 0.242061 0.219104 0.216187 0.228518 0.220791 0.231643 0.293575 0.241768 0.223262 0.223580 0.393284 0.376167
chargesum: 0.00000
title: Mulliken charges with hydrogens summed into heavy atoms:
elementType: O O N C C C C C C C C C C C C C C C C
charge: -0.067277 -0.127598 -0.015683 -0.012764 0.022073 -0.207742 0.335788 0.229333 -0.103632 0.434335 -0.020497 0.071134 -0.178298 -0.096929 0.033344 -0.239159 -0.041378 0.136121 -0.151171
polarizability: 2.67894266e+02 1.55937955e+01 2.03529446e+02 -3.73061101e+00 1.75341904e+00 9.47985903e+01
1716.lowfreq: -4.9067 -3.7867 -0.0009 -0.0007 0.0002 11.0011 57.4307 66.6758 106.7137
frequency: 57.4164 66.6676 106.7061 156.5505 163.2984 200.2761 221.9456 228.8759 273.7162 302.9019 308.2662 325.4102 338.7047 352.2924 403.0074 415.9703 439.5106 467.4574 476.9069 521.8831 529.3314 537.5701 543.4813 577.1909 590.2244 601.2785 624.5810 637.4465 711.2343 731.0465 744.7663 755.0866 759.8693 781.5560 796.8146 810.9760 871.4418 902.5463 905.6096 921.4546 954.1285 974.7827 984.1961 992.3697 1004.7640 1059.0913 1079.7897 1089.5144 1107.3174 1128.3814 1140.6951 1153.9348 1172.9483 1185.3946 1197.7270 1199.6724 1212.5397 1238.7942 1249.2528 1263.6211 1281.3644 1297.9743 1303.8821 1309.7682 1324.4403 1339.0429 1353.7099 1372.3995 1402.7338 1432.9088 1443.6937 1449.6248 1456.6269 1458.6729 1462.1947 1481.0079 1489.5504 1586.1667 1596.1434 1599.0095 1625.9855 2931.2386 2947.8921 2954.2678 2990.1077 3014.2550 3051.2883 3056.0407 3112.2223 3125.1572 3143.0763 3149.8420 3197.5358 3388.7238 3480.0737 3634.6287
redmass: 4.6456 4.6434 3.4073 3.8765 5.1745 3.4450 2.7622 1.2132 2.9782 4.2327 3.5968 4.9848 6.6278 3.8046 3.6066 4.0301 4.4880 4.5411 3.7253 4.1348 2.3478 1.4304 4.7034 4.7517 3.0674 3.0159 3.9802 3.1820 2.9626 4.0089 3.3065 3.5216 2.5343 1.4896 2.2258 2.6148 2.2106 1.3731 2.5493 1.4541 2.6465 2.5002 1.4828 2.3239 3.1274 3.1554 2.2391 2.0334 1.6431 2.6516 1.3848 1.8681 1.4598 1.5302 1.3522 1.6949 1.3226 1.6967 2.0555 2.3323 1.9164 1.6174 1.9397 1.5789 1.8716 1.4804 1.4785 4.1860 4.1944 2.6169 1.1566 1.8794 1.1912 1.2653 1.1706 3.0632 3.4969 6.3938 6.8239 7.5224 7.0186 1.0728 1.0769 1.0629 1.0653 1.0924 1.0922 1.1045 1.0877 1.0878 1.0949 1.0967 1.0939 1.0736 1.0643 1.0667
irintensity: 0.9758 3.8158 0.5088 2.2529 1.1608 3.5421 44.6358 138.1833 0.2116 1.9051 1.3014 5.6472 1.8514 1.9357 5.0402 2.7960 4.1297 4.2222 5.2363 7.2737 34.6823 80.7437 8.8979 2.7867 11.6899 10.3322 14.5418 2.1677 81.5024 24.4606 19.9598 11.7152 23.5006 57.9539 6.0347 64.6430 8.8689 0.5234 34.5053 3.9964 5.9924 53.7780 5.4538 12.8195 22.2570 7.4124 33.2900 59.4936 49.2082 14.2108 28.3439 4.7348 7.4564 1.5207 18.3270 5.5673 2.0655 12.3833 101.5025 149.8693 31.3940 12.1533 53.4993 2.1359 1.4948 2.0231 0.6717 1.8049 4.9935 8.8296 17.4812 30.0669 18.4651 10.4985 25.0710 33.9993 24.2951 12.5754 5.5903 3.0989 9.4350 7.9428 43.4871 40.0823 42.4859 60.1467 23.8487 48.5226 11.5963 10.5284 36.5068 17.6791 5.3406 2.2330 102.9882 65.7870
temp: 298.150 k
press: 1.00000 atm
elementType: 8 8 7 6 6 6 6 6 6 6 6 6 6 6 6 6 6 6 6 1 1 1 1 1 1 1 1 1 1 1 1 1 1 1
symmnumber: 1
zpe: 716523.9 jmol-1
zpe.correction: 0.272910 hartree
zpe.thermalcorrener: 0.287883 hartree
zpe.thermalcorrenthalpy: 0.288827 hartree
zpe.thermalcorrgfe: 0.231929 hartree
zpe.sumelectzpe: -822.565175 hartree
zpe.sumelectthermal: -822.550201 hartree
zpe.sumelectthermalent: -822.549257 hartree
zpe.sumelectthermalfe: -822.606155 hartree
dipole: -1.9234 -1.0298 -0.4590
dipole: 2.2295
quadrupole: -78.7438 -109.9617 -113.5974
quadrupole: 6.9958 -3.3179 1.8597
quadrupole: 22.0238 -9.1941 -12.8298 6.9958 -3.3179 1.8597
hfenergy: -822.8380846 hartree
pointgroup: C01 [X(C16H15N1O2)]
dipole: 0.7738998 0.3724425 -0.1782137 debye
polarizability: 269.0442537|12.8772708|202.3227175|4.4655388|-2.2700304|94.855331 unknown
InChI: InChI=1S/C16H15NO2/c18-13-5-4-10-8-12-14-9(6-7-17-12)2-1-3-11(14)15(10)16(13)19/h1-5,12,17-19H,6-8H2
charge 0 multiplicity 1
34 atoms
O  2.429898 -2.077749 0.417615
O  4.678293 -0.742948 0.434454
N  -2.611206 2.209317 0.044573
C  -1.342988 1.473971 0.273871
C  -1.437468 -0.041836 0.036312
C  -0.221031 2.053753 -0.603175
C  -2.701938 -0.683872 -0.005999
C  -0.228923 -0.795589 -0.12459
C  -4.000589 0.108376 0.147902
C  1.093653 1.344444 -0.329871
C  -3.756736 1.533282 0.704302
C  1.07563 -0.073104 -0.095402
C  -2.760492 -2.085101 -0.21334
C  -0.320253 -2.199081 -0.331844
C  2.325163 -0.704148 0.151939
C  2.301405 2.069821 -0.319066
C  -1.578334 -2.834725 -0.375743
C  3.531015 0.047246 0.158169
C  3.539631 1.42825 -0.078519
H  -1.062855 1.637278 1.337481
H  -0.129975 3.13805 -0.415426
H  -0.506909 1.925393 -1.671102
H  -2.783481 2.315602 -0.968588
H  -4.497239 0.186745 -0.842223
H  -4.702372 -0.446858 0.801525
H  -4.660966 2.158178 0.589307
H  -3.52892 1.481509 1.786358
H  -3.7382 -2.582658 -0.244999
H  0.592924 -2.783876 -0.448278
H  2.278372 3.14971 -0.498907
H  -1.63247 -3.917577 -0.534503
H  4.476589 1.997814 -0.069488
H  3.387015 -2.27669 0.609042
H  5.502557 -0.202627 0.456614
