program: Orca
programVersion: 4.2.1
elementType: O O N N N C C C C C C C C C C C C C C C C C C C C H H H H H H H H H H H H H H H H H H H H H H H
charge: 0
multiplicity: 1
keywords: wb97x-d3
keywords: def2-TZVPP
keywords: def2/J RIJCOSX GRIDX6 NOFINALGRIDX
keywords: grid4 nofinalgrid
keywords: scfconv7
keywords: smallprint printgap noloewdin
keywords: NOSOSCF
formula: C20H23N3O2
InChI: InChI=1S/C20H23N3O2/c1-20(2,3)18(24)19(23-14-21-13-22-23)25-17-11-9-16(10-12-17)15-7-5-4-6-8-15/h4-14,18-19,24H,1-3H3
48 atoms
O  3.419458 1.803358 1.562275
O  1.211654 0.435096 1.288388
N  1.975233 -0.921486 -0.426052
N  2.423216 -2.025165 0.180993
N  1.346859 -2.550365 -1.718147
C  4.501844 1.094666 -0.437367
C  3.497374 0.71486 0.673617
C  2.075878 0.385086 0.174612
C  4.116796 2.407203 -1.124251
C  5.876663 1.260736 0.218936
C  4.622054 -0.00343 -1.497638
C  -0.125732 0.340857 0.986241
C  1.323657 -1.253836 -1.543451
C  -0.783446 1.389396 0.358549
C  -0.814719 -0.812224 1.327984
C  2.029936 -2.968244 -0.633072
C  -2.853849 0.132531 0.422464
C  -2.135211 1.279212 0.079559
C  -2.170481 -0.906448 1.054891
C  -4.296154 0.02695 0.124056
C  -4.861396 -1.191213 -0.257829
C  -5.127623 1.145236 0.212851
C  -6.215336 -1.287714 -0.542815
C  -6.481112 1.049085 -0.073461
C  -7.031255 -0.167937 -0.452764
H  3.882586 -0.176516 1.187036
H  1.755716 1.098015 -0.592513
H  3.145524 2.353771 -1.620058
H  4.093005 3.248679 -0.432382
H  4.849055 2.645016 -1.897787
H  5.887462 2.052122 0.967383
H  6.623565 1.513441 -0.535841
H  6.200898 0.336148 0.702091
H  4.796511 -0.987236 -1.058207
H  5.472447 0.215303 -2.145916
H  3.748686 -0.06931 -2.146899
H  2.948302 1.52463 2.353836
H  0.8668 -0.526141 -2.196163
H  -0.251124 2.293286 0.089492
H  -0.299478 -1.627873 1.818651
H  2.244314 -4.006947 -0.436694
H  -2.629466 2.098695 -0.426082
H  -2.699664 -1.802647 1.352268
H  -4.236817 -2.070441 -0.354713
H  -4.720616 2.098043 0.52752
H  -6.631432 -2.239908 -0.844716
H  -7.10808 1.927318 0.00741
H  -8.087057 -0.242919 -0.676908
elementType: O N C H
totalener: -1090.77356471 hartree
nucrepener: 2154.00741812 hartree
electener: -3244.78098282 hartree
oneelecener: -5760.88195496 hartree
twoeener: 2516.10097213 hartree
cpcmener: -0.03388208 hartree
kineticenergy: 1086.03094821 hartree
xcener: -106.813861676736 hartree
chargesum: -0.0000000
charge: -0.422494 -0.362297 0.137401 -0.372351 -0.388209 0.258516 0.113762 0.037524 -0.363852 -0.341620 -0.364944 0.209585 0.064273 -0.166003 -0.173985 0.084473 0.139578 -0.201959 -0.196229 0.113824 -0.211563 -0.206583 -0.170514 -0.171368 -0.153780 0.121961 0.150027 0.093504 0.099982 0.102223 0.096598 0.096302 0.099324 0.103081 0.104620 0.098409 0.229164 0.181124 0.153038 0.141026 0.164413 0.148885 0.147631 0.145869 0.146861 0.161370 0.160691 0.162714
qa: -0.4225 -0.3623 0.1374 -0.3724 -0.3882 0.2585 0.1138 0.0375 -0.3639 -0.3416 -0.3649 0.2096 0.0643 -0.1660 -0.1740 0.0845 0.1396 -0.2020 -0.1962 0.1138 -0.2116 -0.2066 -0.1705 -0.1714 -0.1538 0.1220 0.1500 0.0935 0.1000 0.1022 0.0966 0.0963 0.0993 0.1031 0.1046 0.0984 0.2292 0.1811 0.1530 0.1410 0.1644 0.1489 0.1476 0.1459 0.1469 0.1614 0.1607 0.1627
va: 2.0130 1.9942 3.2805 2.8793 3.0542 3.6451 3.9071 4.0026 3.9436 3.9048 3.9637 3.7845 4.0474 3.9442 3.9631 4.0154 3.5253 3.9641 3.9821 3.5138 3.9479 3.9404 3.9111 3.9098 3.8854 1.0180 0.9756 1.0043 1.0178 1.0024 1.0195 1.0055 1.0029 1.0113 1.0082 0.9998 1.0142 0.9958 1.0038 1.0151 0.9946 1.0026 1.0019 1.0053 1.0052 0.9917 0.9920 0.9888
dispcorr: -0.024960557 hartree
energy: -1090.798525263732
dipole: 18.96823 -19.48470 -0.51647 9.04803 -8.27637 0.77166 -5.96944 5.56637 -0.40307
magnitude: 1.01226 au
magnitude: 2.57296 debye
