program: Gaussian 09
title: 000030264
version: EM64L-G09RevD.01
frameworkgroup: C1[X(C18H27NO3)]
method: RPBEPBE
basis: SDD
operation: Freq
keyword: #p
keyword: freq=noraman
keyword: PBEPBE/SDD
title: #p freq=noraman PBEPBE/SDD
converged: YES YES NO NO
title: Mulliken charges:
elementType: O O O N C C C C C C C C C C C C C C C C C C H H H H H H H H H H H H H H H H H H H H H H H H H H H
charge: -0.235326 -0.260934 -0.211112 -0.079247 -0.409520 -0.372679 -0.394039 -0.385527 -0.397524 -0.367874 -0.276407 0.267642 0.183940 -0.515404 0.108591 -0.488097 -0.319588 -0.369702 0.343400 -0.413666 -0.692338 -0.534241 0.322848 0.156004 0.164509 0.201283 0.195379 0.199690 0.200542 0.185666 0.186169 0.207262 0.193146 0.207060 0.194061 0.225418 0.278268 0.227826 0.217061 0.247103 0.223888 0.214276 0.244113 0.204945 0.222066 0.203635 0.224256 0.247793 0.225386
chargesum: 0.00000
title: Mulliken charges with hydrogens summed into heavy atoms:
elementType: O O O N C C C C C C C C C C C C C C C C C C
charge: -0.235326 -0.260934 -0.211112 -0.079247 0.069331 -0.006887 0.001030 0.000682 -0.004093 0.032332 0.143071 0.267642 0.183940 -0.237135 0.108591 -0.043209 -0.072485 0.068462 0.343400 -0.169553 -0.061693 0.163194
polarizability: 2.69329587e+02 -2.23985051e+01 2.55116325e+02 -1.41850959e+01 -3.80816372e+00 1.46600657e+02
1716.lowfreq: -5.2734 -0.0005 0.0002 0.0007 3.4219 6.5861 18.3263 20.6140 36.4942
frequency: 18.1011 20.3259 36.4684 44.7983 61.1235 73.4441 77.0735 91.7152 100.7511 110.0937 120.5376 140.8327 187.9057 216.7791 226.5678 231.6302 234.6003 242.0033 248.2502 263.8712 282.8903 297.1347 332.2272 339.0731 369.9078 386.5892 409.6850 440.6936 450.5639 458.3796 502.4559 519.8151 537.8165 554.5737 592.4935 598.8830 636.2658 710.6662 725.2459 730.1872 749.1434 763.8545 791.4648 804.6641 831.1101 844.6357 854.4597 857.0929 877.9741 885.1247 901.2785 932.9913 939.1382 947.9247 959.2051 980.6269 996.4148 1013.7333 1018.1869 1049.1208 1054.2728 1074.8986 1078.9978 1092.5416 1111.9343 1113.6464 1114.9565 1122.5744 1142.7968 1147.1417 1149.5220 1164.2562 1187.9124 1197.0022 1210.4514 1218.3727 1235.5784 1251.2318 1257.5721 1266.4976 1279.6134 1287.1184 1291.7632 1292.0344 1305.3057 1330.3773 1337.7593 1341.9447 1346.3860 1349.5340 1364.2933 1382.1962 1391.4047 1393.6917 1396.8153 1413.7365 1435.4996 1440.9423 1447.2334 1451.6053 1452.6336 1458.7329 1465.8494 1468.2384 1469.9367 1470.2192 1472.9614 1478.5547 1484.1321 1491.4891 1494.7990 1550.6304 1588.6015 1616.8550 2813.7280 2824.6470 2891.8120 2954.0198 2955.7776 2961.5688 2967.1116 2968.9814 2978.4919 2985.9193 3005.1634 3008.2336 3011.4488 3017.1734 3027.2766 3039.0382 3041.6541 3046.1828 3051.6655 3058.0602 3071.0565 3076.6620 3086.8487 3129.4992 3156.4482 3177.8293 3186.6177
redmass: 4.0843 3.6861 4.6926 3.6715 2.6637 2.2488 3.1307 4.0613 3.5371 3.1200 3.9841 2.9817 3.5431 1.6089 2.1535 1.1483 2.7325 2.1844 3.4966 2.5433 4.2024 4.1572 1.9073 5.5116 3.5704 2.1280 2.7629 3.9325 2.8789 3.0486 3.1966 4.1395 1.6844 2.9448 4.2578 5.3525 3.4835 5.5162 2.2798 2.2774 1.5223 4.5590 1.4686 1.4993 3.3141 2.7147 1.4219 1.8261 1.4751 2.3941 2.6889 3.2273 1.3783 2.3039 1.2985 3.1551 2.7144 2.1724 3.5897 2.0281 2.6018 1.7344 1.5173 1.7555 1.2586 2.2995 2.3541 2.7379 2.0687 1.4516 1.2507 2.4069 1.6610 1.3832 2.2750 1.3635 1.2894 3.2648 1.2647 1.1784 1.4923 1.4923 1.2681 1.3150 1.3637 1.3017 1.4020 1.4909 1.6545 1.4351 1.5467 1.4927 1.2296 3.2558 1.3995 3.1822 1.1936 1.1098 1.0902 1.0927 1.1689 1.0877 1.1028 1.0502 1.0726 1.0726 1.0632 1.0431 1.0749 2.0929 1.2166 6.7469 9.0541 6.3942 1.0711 1.0699 1.0689 1.0582 1.0614 1.0620 1.0326 1.0361 1.0622 1.0619 1.0640 1.0877 1.0941 1.0885 1.0956 1.1045 1.1029 1.0994 1.1031 1.1043 1.0988 1.1019 1.0899 1.1000 1.0866 1.0955 1.0908
irintensity: 1.8424 0.1125 0.7795 0.7823 0.4216 0.4620 1.6048 4.3282 1.8590 1.2200 0.7260 2.5640 2.2708 1.6887 0.2933 0.0929 3.5433 0.6824 0.4099 1.3892 15.4930 0.3691 1.4067 3.1069 0.6601 1.4458 3.2424 1.0644 0.0786 2.8153 8.3705 3.0043 1.0729 3.9489 13.0201 21.1811 6.7101 0.3982 3.8229 10.8505 11.1352 4.7915 23.5246 0.1967 5.2165 8.4181 5.3224 39.7645 4.0529 42.8147 9.4554 4.1814 0.3208 20.4309 5.5573 30.4668 46.7954 14.0337 91.5056 6.6614 4.6841 3.4694 0.9061 2.9823 0.2086 40.1826 7.8155 6.1412 312.8428 4.0419 5.4558 20.1280 84.8285 9.9425 127.1630 2.5282 6.0401 175.9880 5.0474 2.2525 29.7459 43.5761 17.7055 31.0760 12.1468 8.1542 0.1651 21.7643 12.6978 8.3728 37.2094 3.1643 10.6669 4.7162 0.0724 43.5357 25.5649 11.9368 9.9369 4.3781 31.9318 14.9402 9.8568 14.2476 8.7675 3.4689 40.7598 12.3437 16.1420 26.8892 19.3289 258.9051 127.8048 373.7321 54.0128 161.2358 87.7675 41.5636 20.5983 44.6445 68.9878 47.2826 36.6155 34.1361 17.4901 32.5817 10.4074 72.7838 64.8264 31.4327 33.8713 2.9977 90.3227 43.7283 53.4290 75.6579 17.4652 23.0692 6.6151 12.6730 1.1889
temp: 298.150 k
press: 1.00000 atm
elementType: 8 8 8 7 6 6 6 6 6 6 6 6 6 6 6 6 6 6 6 6 6 6 1 1 1 1 1 1 1 1 1 1 1 1 1 1 1 1 1 1 1 1 1 1 1 1 1 1 1
symmnumber: 1
zpe: 1097864.0 jmol-1
zpe.correction: 0.418154 hartree
zpe.thermalcorrener: 0.441299 hartree
zpe.thermalcorrenthalpy: 0.442243 hartree
zpe.thermalcorrgfe: 0.363362 hartree
zpe.sumelectzpe: -980.793218 hartree
zpe.sumelectthermal: -980.770073 hartree
zpe.sumelectthermalent: -980.769129 hartree
zpe.sumelectthermalfe: -980.848010 hartree
dipole: 4.0863 -2.2326 0.2624
dipole: 4.6638
quadrupole: -107.1154 -126.5110 -132.8445
quadrupole: -2.4475 -7.6123 -1.8622
quadrupole: 15.0416 -4.3540 -10.6875 -2.4475 -7.6123 -1.8622
hfenergy: -981.2113724 hartree
pointgroup: C01 [X(C18H27N1O3)]
dipole: -1.8309418 0.1194821 -0.0124882 debye
polarizability: 282.7441598|-3.5344642|236.7417443|19.1013829|-20.4093557|151.5606659 unknown
InChI: InChI=1S/C18H27NO3/c1-3-7-17(20)16-9-8-15(21-2)14-18(16)22-13-12-19-10-5-4-6-11-19/h8-9,14H,3-7,10-13H2,1-2H3
charge 0 multiplicity 1
49 atoms
O  0.048353 0.749572 0.25203
O  -4.535227 1.235515 -1.149792
O  1.029244 -1.776879 0.461518
N  2.657895 2.185378 -0.496594
C  3.143978 0.788572 -0.304058
C  3.790057 3.141327 -0.593481
C  4.033253 0.356624 -1.485318
C  4.700591 2.785272 -1.788154
C  5.218237 1.33225 -1.673156
C  1.64028 2.585047 0.498557
C  0.210576 2.212875 0.094536
C  -1.18083 0.181869 -0.049099
C  -1.317618 -1.247087 0.115535
C  -2.28211 0.960144 -0.472405
C  -0.18316 -2.143729 0.501853
C  -0.521636 -3.583012 0.948387
C  -2.600385 -1.801908 -0.13924
C  0.694523 -4.342546 1.513846
C  -3.532455 0.355131 -0.731637
C  -3.705575 -1.040859 -0.561183
C  0.338173 -5.789616 1.914645
C  -5.859833 0.674644 -1.438085
H  2.280015 0.114562 -0.197655
H  3.74054 0.715952 0.645462
H  4.408795 3.144932 0.344646
H  3.382051 4.162282 -0.724479
H  4.397854 -0.673057 -1.306364
H  3.416797 0.336632 -2.405169
H  4.11362 2.894464 -2.721018
H  5.54541 3.500372 -1.834549
H  5.898046 1.254685 -0.798539
H  5.812037 1.062748 -2.567846
H  1.6567 3.689406 0.590708
H  1.845487 2.170432 1.515438
H  -0.522955 2.727666 0.751118
H  0.036966 2.491922 -0.962823
H  -2.204916 2.040263 -0.61144
H  -1.338175 -3.556406 1.697954
H  -0.924746 -4.141383 0.076427
H  -2.738881 -2.879958 -0.018877
H  1.504699 -4.338323 0.762443
H  1.09342 -3.791363 2.38613
H  -4.663816 -1.529497 -0.753745
H  -0.452826 -5.810399 2.68874
H  1.219529 -6.31871 2.320858
H  -0.02908 -6.367632 1.044755
H  -6.298553 0.201284 -0.538956
H  -6.473571 1.534629 -1.742699
H  -5.811477 -0.061686 -2.262923
