program: Gaussian 09
title: 000030178
version: EM64L-G09RevD.01
frameworkgroup: C1[X(C20H30N2O4)]
method: RPBEPBE
basis: SDD
operation: Freq
keyword: #p
keyword: freq=noraman
keyword: PBEPBE/SDD
title: #p freq=noraman PBEPBE/SDD
converged: YES YES NO NO
title: Mulliken charges:
elementType: O O O O N N C C C C C C C C C C C C C C C C C C C C H H H H H H H H H H H H H H H H H H H H H H H H H H H H H H
charge: -0.250358 -0.237552 -0.215182 -0.218318 -0.261917 -0.256355 0.024922 0.023646 -0.432521 -0.430194 -0.427878 -0.433860 -0.401633 -0.397883 -0.398646 -0.400669 -0.340375 -0.392627 -0.393068 0.233619 0.190316 0.165667 -0.424931 -0.514401 0.232906 -0.771852 0.244818 0.244778 0.235501 0.210667 0.201052 0.244983 0.244674 0.201542 0.204926 0.245067 0.203742 0.197798 0.196929 0.202498 0.202291 0.196690 0.196602 0.203262 0.277503 0.200301 0.197766 0.200050 0.199116 0.257833 0.253687 0.237988 0.290565 0.237881 0.241221 0.257411
chargesum: 0.00000
title: Mulliken charges with hydrogens summed into heavy atoms:
elementType: O O O O N N C C C C C C C C C C C C C C C C C C C C
charge: -0.250358 -0.237552 -0.215182 -0.218318 -0.261917 -0.256355 0.269740 0.268424 0.013648 0.015841 0.018337 0.016134 -0.000092 0.001544 0.000335 -0.000804 -0.062872 0.005440 0.006098 0.233619 0.190316 0.165667 0.086588 0.014152 0.232906 -0.035339
polarizability: 2.77584134e+02 -1.98446534e-01 2.34905676e+02 4.17250445e+00 -9.56764460e+00 1.95116898e+02
1716.lowfreq: -28.7724 -20.3918 -0.0004 0.0007 0.0009 1.4717 7.5536 11.9302 24.2162
frequency: -24.6682 7.3798 24.0799 32.1810 37.9424 56.9047 61.2746 68.1650 89.8559 95.8700 109.4419 139.8227 158.6975 164.6408 175.5681 184.0754 202.9605 216.6228 219.1906 220.6992 247.9673 254.9886 298.8011 331.7147 341.3674 373.4198 392.2548 405.0163 408.8832 431.6431 440.6333 445.5917 451.6467 457.2994 468.5920 475.3876 480.0669 545.6501 555.9589 570.9826 610.4527 682.4369 707.3033 715.2960 734.8000 741.6576 763.9618 775.0758 791.9156 795.2756 810.9274 825.0864 836.2466 847.8486 865.6561 889.3957 897.5757 898.6255 905.4235 923.2397 923.7573 930.6416 943.9988 983.4640 987.9241 1005.7185 1032.2927 1044.0992 1046.9988 1055.2380 1061.6000 1062.9477 1070.7906 1077.1250 1078.4713 1080.9436 1107.0713 1108.1124 1110.3326 1141.0460 1155.7523 1169.2516 1174.8479 1188.4584 1196.8499 1198.4002 1242.1336 1250.3018 1251.2879 1259.2313 1260.1557 1263.4431 1265.5623 1272.0377 1285.8162 1300.4874 1307.9304 1310.0913 1310.4295 1324.3755 1333.8519 1335.8410 1336.5891 1339.6285 1339.7701 1341.5084 1347.4451 1347.4977 1350.0450 1350.3098 1354.6669 1369.9732 1388.1112 1402.6061 1443.1180 1443.3939 1457.0499 1459.3155 1464.9424 1467.9074 1468.6393 1469.9944 1471.7469 1473.2703 1474.8137 1477.7635 1484.8603 1488.0937 1577.9629 1594.7329 1633.9258 1639.9898 2962.2257 2969.2598 2969.7728 2970.1554 2972.1593 2973.0937 2974.7838 2981.2746 2993.8043 2994.1817 2997.1187 2997.6626 3004.8010 3019.3901 3032.1182 3032.2758 3032.6334 3033.6229 3033.9875 3035.2555 3043.2748 3043.4272 3057.3150 3064.6121 3065.3675 3066.8791 3073.8155 3074.7747 3076.5272 3121.5371
redmass: 4.0422 6.2051 4.9221 3.6911 3.2951 4.2188 3.7231 5.8703 3.0175 3.7155 1.1500 2.5351 5.3454 4.8555 3.1512 4.6388 3.2160 2.6005 2.4796 1.8715 3.8439 4.6868 6.0898 1.8338 1.8815 4.6286 4.2344 4.4028 3.6615 4.9748 3.7695 3.6107 3.0914 3.9786 2.3125 2.0283 2.2803 3.0623 3.0779 4.4007 8.4117 6.4389 4.0252 4.2708 5.6620 3.8351 1.9666 2.1227 1.4270 1.4226 3.2146 3.3664 2.7308 1.7767 1.7026 2.0414 1.6998 1.7223 1.7394 1.6121 1.6447 2.6833 2.0969 2.0516 2.3449 2.9206 2.5434 1.8845 1.8348 4.1956 1.1711 1.1880 3.0064 1.3407 1.3699 2.9214 2.5754 4.8575 2.7140 2.6719 1.5629 2.6886 2.6224 2.1095 1.5990 1.6091 1.3552 1.3037 1.3494 1.2713 1.2798 1.3959 1.3405 1.4037 1.3286 1.7319 1.8571 1.3477 1.3376 2.1210 1.3489 1.3501 1.4873 1.4927 1.5873 1.4253 1.3340 1.4445 1.3800 1.4165 1.5761 1.2457 1.4295 1.8632 1.0584 1.0996 1.0579 1.0878 1.0871 1.0876 1.0867 1.0864 1.0862 1.0856 1.0860 1.0861 1.0922 1.0916 10.9211 8.9196 7.5701 10.8636 1.0631 1.0631 1.0626 1.0629 1.0618 1.0630 1.0628 1.0383 1.0615 1.0619 1.0633 1.0634 1.0594 1.0948 1.0965 1.0945 1.0920 1.0967 1.0924 1.0888 1.1024 1.1025 1.0882 1.1016 1.1011 1.0951 1.1001 1.0987 1.0988 1.1004
irintensity: 0.1883 1.6978 1.0792 3.7056 1.9577 0.3174 0.4061 0.8696 0.0222 1.1810 0.5111 0.3440 7.7227 0.6283 0.8971 8.5909 0.9150 3.1200 3.0304 0.5392 0.2646 16.4566 3.9299 1.5721 0.3130 4.5079 0.2729 5.1361 17.4275 2.0029 2.6547 16.3851 5.9020 17.5195 1.6760 0.6161 0.2177 19.5281 23.7028 2.9755 0.0940 9.2902 7.3079 7.9217 4.5586 4.0031 4.5712 1.9524 0.3558 0.4343 0.6628 0.3931 4.7296 0.5257 0.4126 4.1448 15.7680 19.8989 9.8696 0.3264 0.3023 4.1991 18.7073 21.9917 30.3352 19.5586 54.3514 0.7999 1.4485 18.4702 1.2291 1.6457 2.0512 0.5180 0.6317 3.7263 0.1276 0.1189 0.1970 117.3187 24.7397 3.7341 89.6569 77.5044 0.0946 0.1934 150.9930 2.7161 7.4702 0.9418 3.0204 25.3193 0.7840 6.5682 8.6306 121.0627 266.1213 14.3212 1.3263 153.9788 2.4582 1.7316 24.4395 2.6474 8.1426 0.7148 0.3160 13.7662 4.8082 10.6701 23.4486 68.9045 8.1892 116.1482 2.7059 39.1994 18.8980 7.7319 5.5809 5.3055 8.3696 11.6826 4.1704 13.1113 17.2663 15.5879 4.1907 4.4418 456.1314 289.0396 99.4069 11.3421 29.7901 28.7472 22.4924 48.9716 33.7503 35.7894 33.7287 5.0419 12.2456 64.6379 25.1129 20.1561 7.4156 6.6391 74.8137 67.3112 54.6447 57.0274 20.9964 0.9027 19.3536 71.6619 1.4094 7.0799 1.8902 10.7115 10.7636 35.5774 32.9494 12.7338
temp: 298.150 k
press: 1.00000 atm
elementType: 8 8 8 8 7 7 6 6 6 6 6 6 6 6 6 6 6 6 6 6 6 6 6 6 6 6 1 1 1 1 1 1 1 1 1 1 1 1 1 1 1 1 1 1 1 1 1 1 1 1 1 1 1 1 1 1
symmnumber: 1
zpe: 1250679.8 jmol-1
zpe.correction: 0.476359 hartree
zpe.thermalcorrener: 0.501431 hartree
zpe.thermalcorrenthalpy: 0.502375 hartree
zpe.thermalcorrgfe: 0.418821 hartree
zpe.sumelectzpe: -1188.580564 hartree
zpe.sumelectthermal: -1188.555492 hartree
zpe.sumelectthermalent: -1188.554548 hartree
zpe.sumelectthermalfe: -1188.638101 hartree
dipole: -0.9244 0.1617 -1.1300
dipole: 1.4689
quadrupole: -147.1741 -149.3759 -167.6500
quadrupole: -5.4660 4.0681 -4.6449
quadrupole: 7.5592 5.3574 -12.9167 -5.4660 4.0681 -4.6449
hfenergy: -1189.0569224 hartree
pointgroup: C01[X(C20H30N2O4)]
dipole: -0.3649026 -0.0682023 0.4429 debye
polarizability: 277.5700001|1.8104148|234.5723613|-3.1331411|-10.4979311|195.4643467 unknown
InChI: InChI=1S/C20H30N2O4/c1-14(23)12-13-17-18(24)21(15-8-4-2-5-9-15)20(26)22(19(17)25)16-10-6-3-7-11-16/h15-17H,2-13H2,1H3
charge 0 multiplicity 1
56 atoms
O  0.702981 2.005904 -1.173058
O  -2.283675 -0.205104 1.669202
O  2.27352 -1.4152 1.605509
O  -1.94405 -3.788685 -1.712569
N  -0.839271 0.88837 0.185299
N  1.526653 0.26186 0.150408
C  -1.905762 1.856879 -0.272372
C  2.926734 0.612322 -0.299578
C  -3.068705 1.124485 -0.983704
C  -2.405636 2.775018 0.870554
C  3.762146 1.214325 0.857483
C  3.63812 -0.581122 -0.979832
C  -4.07091 2.163895 -1.542902
C  -3.415792 3.803357 0.30155
C  5.152135 1.647779 0.329882
C  5.027334 -0.130424 -1.497296
C  -0.12096 -1.231753 1.268067
C  -4.588758 3.102056 -0.425869
C  5.885416 0.472013 -0.358141
C  0.473712 1.090237 -0.338108
C  -1.159841 -0.137953 1.093849
C  1.321119 -0.798197 1.055249
C  -0.440728 -2.415955 0.280484
C  -1.73995 -3.159142 0.642672
C  -2.317315 -3.969918 -0.522554
C  -3.38128 -4.999498 -0.164241
H  -1.390114 2.48801 -1.017937
H  2.773804 1.399756 -1.059324
H  -3.586244 0.460567 -0.26841
H  -2.668926 0.49751 -1.803781
H  -1.545719 3.298125 1.331599
H  -2.890644 2.16464 1.652659
H  3.88296 0.461991 1.657593
H  3.22817 2.084024 1.286795
H  3.018731 -0.953331 -1.818661
H  3.763457 -1.4074 -0.258119
H  -4.916292 1.639277 -2.027493
H  -3.57602 2.770349 -2.32942
H  -2.895991 4.477216 -0.410657
H  -3.797284 4.438746 1.123554
H  5.758738 2.041324 1.167782
H  5.031574 2.478111 -0.396528
H  4.89926 0.626798 -2.298555
H  5.546897 -0.994216 -1.954328
H  -0.200832 -1.614406 2.299864
H  -5.277577 3.857221 -0.851113
H  -5.171293 2.508837 0.308202
H  6.86086 0.812076 -0.756184
H  6.098505 -0.315543 0.393279
H  0.414824 -3.114711 0.315235
H  -0.511352 -2.04309 -0.75813
H  -1.594268 -3.826383 1.515091
H  -2.524503 -2.437795 0.956782
H  -4.077452 -4.611013 0.60106
H  -2.893218 -5.896106 0.266199
H  -3.938186 -5.304029 -1.064037
