program: Orca
programVersion: 4.2.1
elementType: O O N N N C C C C C C C C C C C C C C C C C C C C H H H H H H H H H H H H H H H H H H H H H H H
charge: 0
multiplicity: 1
keywords: wb97x-d3
keywords: def2-TZVPP
keywords: def2/J RIJCOSX GRIDX6 NOFINALGRIDX
keywords: grid4 nofinalgrid
keywords: scfconv7
keywords: smallprint printgap noloewdin
keywords: NOSOSCF
formula: C20H23N3O2
InChI: InChI=1S/C20H23N3O2/c1-20(2,3)18(24)19(23-14-21-13-22-23)25-17-11-9-16(10-12-17)15-7-5-4-6-8-15/h4-14,18-19,24H,1-3H3
48 atoms
O  3.983172 0.256237 1.307751
O  1.368776 0.509272 0.518659
N  2.166046 -1.617382 0.033132
N  2.149356 -2.550476 -0.922687
N  2.091259 -3.500652 1.107838
C  3.98121 1.699374 -0.701229
C  3.66653 0.326234 -0.061168
C  2.246301 -0.202996 -0.29765
C  3.725686 1.625419 -2.207809
C  3.17577 2.858156 -0.109756
C  5.471991 1.974436 -0.476792
C  0.023923 0.405563 0.333741
C  2.132935 -2.196093 1.235344
C  -0.581376 -0.338989 -0.67057
C  -0.763173 1.118324 1.233133
C  2.105174 -3.657252 -0.228914
C  -2.774282 0.340892 0.12768
C  -1.966161 -0.361768 -0.762103
C  -2.140453 1.083683 1.127236
C  -4.245929 0.292704 0.022664
C  -4.873233 0.215583 -1.222802
C  -5.047102 0.314173 1.166267
C  -6.255268 0.156249 -1.321293
C  -6.429446 0.258401 1.067804
C  -7.040334 0.177158 -0.176314
H  4.325399 -0.394615 -0.556735
H  1.989337 -0.13132 -1.357415
H  4.099222 2.527143 -2.695465
H  4.235505 0.773737 -2.664144
H  2.66493 1.552664 -2.454665
H  3.280201 2.93549 0.975079
H  2.113261 2.798701 -0.341687
H  3.541993 3.799852 -0.522901
H  5.715968 2.087652 0.579609
H  5.763339 2.898281 -0.979314
H  6.094425 1.171928 -0.879467
H  3.47678 0.922998 1.784825
H  2.125584 -1.651834 2.164791
H  -0.014128 -0.918034 -1.385738
H  -0.292606 1.706309 2.010716
H  2.079676 -4.622268 -0.709615
H  -2.413887 -0.967395 -1.539513
H  -2.726817 1.662191 1.829704
H  -4.27939 0.219524 -2.128238
H  -4.58928 0.353865 2.146716
H  -6.719249 0.100571 -2.297307
H  -7.030238 0.269215 1.967815
H  -8.118601 0.130841 -0.252932
elementType: O N C H
totalener: -1090.77638702 hartree
nucrepener: 2139.91969078 hartree
electener: -3230.69607780 hartree
oneelecener: -5732.23752500 hartree
twoeener: 2501.54144720 hartree
cpcmener: -0.03294750 hartree
kineticenergy: 1086.02964921 hartree
xcener: -106.815900681076 hartree
chargesum: 0.0000000
charge: -0.434489 -0.310538 0.114434 -0.352241 -0.413192 0.196659 0.177477 0.038324 -0.360855 -0.332882 -0.327134 0.295426 0.078110 -0.197198 -0.249315 0.071874 0.112343 -0.208552 -0.149044 0.093975 -0.206727 -0.210905 -0.173570 -0.173292 -0.153996 0.116430 0.157802 0.100529 0.109181 0.097757 0.092496 0.095097 0.101216 0.096029 0.096416 0.098374 0.231267 0.171586 0.131905 0.144153 0.165334 0.147105 0.147516 0.146644 0.144900 0.160519 0.160562 0.162491
qa: -0.4345 -0.3105 0.1144 -0.3522 -0.4132 0.1967 0.1775 0.0383 -0.3609 -0.3329 -0.3271 0.2954 0.0781 -0.1972 -0.2493 0.0719 0.1123 -0.2086 -0.1490 0.0940 -0.2067 -0.2109 -0.1736 -0.1733 -0.1540 0.1164 0.1578 0.1005 0.1092 0.0978 0.0925 0.0951 0.1012 0.0960 0.0964 0.0984 0.2313 0.1716 0.1319 0.1442 0.1653 0.1471 0.1475 0.1466 0.1449 0.1605 0.1606 0.1625
va: 2.0234 2.0647 3.3203 2.8720 3.0471 3.7867 3.8624 3.9916 3.9349 3.9460 3.9156 3.7128 4.0763 3.9524 4.0333 4.0361 3.5636 4.0174 3.9356 3.5314 3.9376 3.9442 3.9134 3.9131 3.8830 1.0113 0.9838 1.0049 1.0031 1.0015 1.0107 1.0071 1.0042 1.0178 1.0071 1.0034 1.0142 1.0115 1.0293 1.0096 0.9931 1.0030 1.0008 1.0047 1.0059 0.9922 0.9922 0.9890
dispcorr: -0.024217540 hartree
energy: -1090.800604557716
dipole: 14.25858 -14.54167 -0.28308 16.42855 -14.47014 1.95841 -6.94278 6.41157 -0.53121
magnitude: 2.04883 au
magnitude: 5.20771 debye
