program: Orca
programVersion: 4.2.1
elementType: O O N N N C C C C C C C C C C C C C C C C C C C C H H H H H H H H H H H H H H H H H H H H H H H
charge: 0
multiplicity: 1
keywords: wb97x-d3
keywords: def2-TZVPP
keywords: def2/J RIJCOSX GRIDX6 NOFINALGRIDX
keywords: grid4 nofinalgrid
keywords: scfconv7
keywords: smallprint printgap noloewdin
keywords: NOSOSCF
formula: C20H23N3O2
InChI: InChI=1S/C20H23N3O2/c1-20(2,3)18(24)19(23-14-21-13-22-23)25-17-11-9-16(10-12-17)15-7-5-4-6-8-15/h4-14,18-19,24H,1-3H3
48 atoms
O  3.97252 0.300414 1.342133
O  1.356765 0.479467 0.556154
N  2.203871 -1.626283 0.074762
N  2.246253 -2.562262 -0.8777
N  2.163626 -3.507342 1.154285
C  3.932298 1.730964 -0.676855
C  3.656337 0.353694 -0.027827
C  2.249484 -0.211915 -0.260772
C  3.086657 2.868723 -0.100271
C  5.411879 2.055189 -0.445327
C  3.689896 1.636156 -2.184654
C  0.014628 0.37111 0.352921
C  2.159611 -2.201791 1.27825
C  -0.784746 1.095633 1.231778
C  -0.575189 -0.38768 -0.64994
C  2.222704 -3.668244 -0.181064
C  -2.778409 0.312354 0.100139
C  -2.159917 1.063408 1.103086
C  -1.958443 -0.406641 -0.765197
C  -4.247793 0.278532 -0.035075
C  -4.849571 0.209758 -1.293436
C  -5.071935 0.311964 1.091746
C  -6.230018 0.171783 -1.420767
C  -6.452579 0.277274 0.964417
C  -7.038319 0.205636 -0.292375
H  4.334031 -0.353339 -0.518084
H  1.98879 -0.1478 -1.319962
H  3.429736 3.819152 -0.513278
H  2.02907 2.77789 -0.344506
H  3.175808 2.953645 0.985361
H  5.675854 2.985533 -0.951001
H  6.062756 1.271562 -0.840173
H  5.64527 2.181633 0.611954
H  4.039741 2.544301 -2.677937
H  2.633734 1.529352 -2.438887
H  4.228319 0.795995 -2.629598
H  3.442951 0.952269 1.815181
H  2.109576 -1.65566 2.20554
H  -0.324631 1.69205 2.009131
H  0.002778 -0.980256 -1.345594
H  2.241596 -4.635095 -0.658342
H  -2.757216 1.652153 1.787581
H  -2.395926 -1.020852 -1.541664
H  -4.23648 0.204856 -2.185986
H  -4.633362 0.345726 2.081218
H  -6.674441 0.123528 -2.406235
H  -7.07187 0.297812 1.85162
H  -8.115349 0.176863 -0.39157
elementType: O N C H
totalener: -1090.77651895 hartree
nucrepener: 2139.40189976 hartree
electener: -3230.17841872 hartree
oneelecener: -5731.18192865 hartree
twoeener: 2501.00350994 hartree
cpcmener: -0.03290320 hartree
kineticenergy: 1086.02551498 hartree
xcener: -106.815007772635 hartree
chargesum: -0.0000000
charge: -0.434673 -0.312345 0.117526 -0.352680 -0.413757 0.196426 0.175467 0.038140 -0.331540 -0.326985 -0.360320 0.295990 0.076702 -0.251581 -0.193591 0.071739 0.113696 -0.146398 -0.211892 0.093254 -0.207204 -0.210460 -0.174672 -0.174036 -0.153775 0.117560 0.157629 0.101128 0.093877 0.092697 0.096323 0.098471 0.096078 0.100579 0.097530 0.109261 0.231313 0.171862 0.144673 0.131088 0.165724 0.147781 0.147421 0.147089 0.145195 0.160640 0.159989 0.163061
qa: -0.4347 -0.3123 0.1175 -0.3527 -0.4138 0.1964 0.1755 0.0381 -0.3315 -0.3270 -0.3603 0.2960 0.0767 -0.2516 -0.1936 0.0717 0.1137 -0.1464 -0.2119 0.0933 -0.2072 -0.2105 -0.1747 -0.1740 -0.1538 0.1176 0.1576 0.1011 0.0939 0.0927 0.0963 0.0985 0.0961 0.1006 0.0975 0.1093 0.2313 0.1719 0.1447 0.1311 0.1657 0.1478 0.1474 0.1471 0.1452 0.1606 0.1600 0.1631
va: 2.0241 2.0602 3.3227 2.8734 3.0473 3.7858 3.8636 3.9926 3.9473 3.9155 3.9354 3.7098 4.0784 4.0347 3.9525 4.0356 3.5609 3.9336 4.0195 3.5310 3.9384 3.9425 3.9166 3.9133 3.8832 1.0117 0.9832 1.0044 1.0066 1.0108 1.0072 1.0033 1.0178 1.0048 1.0017 1.0032 1.0144 1.0104 1.0095 1.0287 0.9930 1.0007 1.0026 1.0045 1.0056 0.9923 0.9924 0.9888
dispcorr: -0.024240399 hartree
energy: -1090.800759351811
dipole: 13.77291 -14.13488 -0.36197 16.70611 -14.74664 1.95947 -7.00744 6.46102 -0.54642
magnitude: 2.06619 au
magnitude: 5.25183 debye
