program: Orca
programVersion: 4.2.1
elementType: O O N N N C C C C C C C C C C C C C C C C C C C C H H H H H H H H H H H H H H H H H H H H H H H
charge: 0
multiplicity: 1
keywords: wb97x-d3
keywords: def2-TZVPP
keywords: def2/J RIJCOSX GRIDX6 NOFINALGRIDX
keywords: grid4 nofinalgrid
keywords: scfconv7
keywords: smallprint printgap noloewdin
keywords: NOSOSCF
formula: C20H23N3O2
InChI: InChI=1S/C20H23N3O2/c1-20(2,3)18(24)19(23-14-21-13-22-23)25-17-11-9-16(10-12-17)15-7-5-4-6-8-15/h4-14,18-19,24H,1-3H3
48 atoms
O  3.274535 2.394047 0.785452
O  1.132741 0.882033 1.04777
N  2.012409 -0.954286 -0.065099
N  1.562038 -1.55892 -1.169886
N  2.129378 -3.075467 0.383519
C  4.5473 0.90773 -0.578249
C  3.4258 1.029027 0.477859
C  2.04868 0.484622 0.051618
C  5.815953 1.523972 0.023498
C  4.862398 -0.554132 -0.908476
C  4.195071 1.649377 -1.868723
C  -0.193421 0.666219 0.762124
C  2.336094 -1.87021 0.851703
C  -0.903489 -0.230685 1.544403
C  -0.824812 1.349512 -0.267686
C  1.661955 -2.823207 -0.855686
C  -2.9089 0.234736 0.267565
C  -2.252386 -0.435977 1.299484
C  -2.170343 1.129475 -0.508922
C  -4.344056 0.008354 0.003823
C  -4.907177 -1.26068 0.151734
C  -5.170859 1.057536 -0.40254
C  -6.25428 -1.474061 -0.099944
C  -6.517835 0.844066 -0.654583
C  -7.06574 -0.422847 -0.505107
H  3.749726 0.47029 1.369521
H  1.763582 0.874686 -0.928732
H  5.717171 2.592135 0.211864
H  6.087192 1.038909 0.964615
H  6.653593 1.3909 -0.663518
H  5.026565 -1.153096 -0.010003
H  5.780973 -0.599274 -1.496275
H  4.090275 -1.036871 -1.506126
H  3.33756 1.211593 -2.383952
H  5.03524 1.599463 -2.564122
H  3.980159 2.703998 -1.695524
H  2.674232 2.48043 1.532695
H  2.70968 -1.628486 1.833974
H  -0.409125 -0.755891 2.351662
H  -0.278469 2.05471 -0.881581
H  1.377939 -3.600292 -1.547221
H  -2.797929 -1.121859 1.934737
H  -2.643534 1.65699 -1.327024
H  -4.285671 -2.097086 0.446332
H  -4.76627 2.056553 -0.506329
H  -6.66809 -2.467359 0.014101
H  -7.141858 1.67274 -0.962582
H  -8.116408 -0.589396 -0.70246
elementType: O N C H
totalener: -1090.77432522 hartree
nucrepener: 2148.76667766 hartree
electener: -3239.54100288 hartree
oneelecener: -5750.41094078 hartree
twoeener: 2510.86993790 hartree
cpcmener: -0.03399490 hartree
kineticenergy: 1086.02479360 hartree
xcener: -106.812015310712 hartree
chargesum: 0.0000000
charge: -0.422943 -0.364192 0.132510 -0.345117 -0.383858 0.266563 0.102278 0.043416 -0.336936 -0.371851 -0.366340 0.219374 0.032503 -0.192976 -0.168451 0.079158 0.128135 -0.187703 -0.201893 0.117296 -0.208168 -0.205638 -0.172308 -0.172952 -0.154795 0.129062 0.154030 0.096166 0.100153 0.095546 0.107102 0.105416 0.097386 0.091728 0.103346 0.103167 0.229380 0.180853 0.149896 0.150978 0.164839 0.147904 0.148432 0.147515 0.146807 0.160787 0.161362 0.163032
qa: -0.4229 -0.3642 0.1325 -0.3451 -0.3839 0.2666 0.1023 0.0434 -0.3369 -0.3719 -0.3663 0.2194 0.0325 -0.1930 -0.1685 0.0792 0.1281 -0.1877 -0.2019 0.1173 -0.2082 -0.2056 -0.1723 -0.1730 -0.1548 0.1291 0.1540 0.0962 0.1002 0.0955 0.1071 0.1054 0.0974 0.0917 0.1033 0.1032 0.2294 0.1809 0.1499 0.1510 0.1648 0.1479 0.1484 0.1475 0.1468 0.1608 0.1614 0.1630
va: 2.0144 1.9890 3.3095 2.8462 3.0545 3.6201 3.9393 3.9732 3.9094 3.9608 3.9372 3.8095 4.0983 3.9942 3.9575 4.0224 3.5306 3.9744 3.9631 3.5149 3.9429 3.9385 3.9116 3.9112 3.8857 0.9968 0.9817 1.0182 1.0024 1.0057 1.0041 1.0097 1.0096 1.0056 1.0034 1.0178 1.0170 0.9979 1.0050 1.0044 0.9942 1.0018 1.0029 1.0044 1.0050 0.9920 0.9918 0.9886
dispcorr: -0.024850750 hartree
energy: -1090.799175969723
dipole: 19.94857 -20.07146 -0.12290 6.17992 -5.61851 0.56141 -5.84899 6.27862 0.42963
magnitude: 0.71754 au
magnitude: 1.82385 debye
