program: Gaussian 09
title: 000030160
version: EM64L-G09RevD.01
frameworkgroup: C1[X(C21H31NO2)]
method: RPBEPBE
basis: SDD
operation: Freq
keyword: #p
keyword: freq=noraman
keyword: PBEPBE/SDD
title: #p freq=noraman PBEPBE/SDD
converged: NO YES NO NO
title: Mulliken charges:
elementType: O O N C C C C C C C C C C C C C C C C C C C C C H H H H H H H H H H H H H H H H H H H H H H H H H H H H H H H
charge: -0.270573 -0.243417 -0.090843 -0.251523 -0.114443 0.171217 -0.532576 -0.574216 -0.459966 -0.480726 0.347526 0.169885 -0.380437 -0.389580 -0.243514 -0.246083 -0.311945 -0.248612 -0.372747 -0.330781 -0.307543 -0.392741 -0.706973 -0.689696 0.274798 0.232081 0.238778 0.225464 0.204379 0.268804 0.218309 0.233909 0.206770 0.227280 0.250531 0.245813 0.225562 0.227368 0.220626 0.235631 0.228985 0.194661 0.230193 0.184300 0.235414 0.199374 0.180678 0.235450 0.213631 0.227640 0.216158 0.209819 0.209364 0.215021 0.233516
chargesum: 0.00000
title: Mulliken charges with hydrogens summed into heavy atoms:
elementType: O O N C C C C C C C C C C C C C C C C C C C C C
charge: -0.270573 -0.243417 -0.090843 0.023275 0.117638 0.171217 -0.068333 -0.101032 -0.007748 -0.046676 0.347526 0.169885 -0.129906 -0.143767 -0.017952 -0.018715 0.144312 -0.019628 0.052108 0.088932 0.072509 0.056339 -0.053356 -0.031796
polarizability: 2.52727819e+02 1.72737913e+01 2.32389814e+02 -9.37534299e+00 4.82102035e+00 1.97409933e+02
1716.lowfreq: -13.9135 -4.6128 -1.4490 -0.0010 -0.0007 -0.0006 7.7518 19.0512 34.4652
frequency: -4.3796 18.7538 34.4550 38.6574 48.9878 53.3146 67.6508 72.1041 84.5062 101.1073 122.5880 147.7795 150.2622 165.2282 195.0060 219.4770 237.5581 242.4712 259.3085 276.6528 289.7703 301.3487 305.9741 322.9198 359.5436 396.3069 398.4583 404.1536 435.3933 443.6019 479.1247 486.7749 506.7561 533.8472 572.6191 615.0531 627.9736 691.6338 706.0252 711.9342 735.8222 748.2044 764.7662 771.5938 773.5172 776.3180 799.6695 805.6182 821.2671 842.1415 850.7716 877.4256 881.5546 890.4327 898.6330 917.3647 936.2043 941.9284 950.2330 960.5174 975.1266 976.1757 980.9385 989.6615 991.9227 995.5599 1018.9902 1028.2244 1036.9104 1041.2983 1057.9340 1062.4201 1064.9929 1077.6359 1088.0562 1091.2483 1096.7508 1111.9393 1115.7130 1122.1086 1153.4251 1161.0354 1162.0042 1172.0110 1184.6408 1196.5674 1201.1276 1208.1617 1221.2026 1224.3054 1244.5614 1248.8413 1254.1849 1266.2776 1276.9716 1286.0705 1292.7986 1294.2610 1308.9050 1311.9401 1316.3365 1321.9492 1335.0501 1341.0751 1354.0370 1367.2683 1373.2486 1375.2157 1385.2172 1385.4336 1431.9336 1448.7282 1459.5794 1463.1942 1464.5769 1465.6705 1473.8367 1474.3081 1476.5587 1478.2868 1480.9778 1482.2405 1489.3195 1494.7065 1499.2873 1586.2793 1604.0215 1615.4679 2854.4024 2867.8434 2975.7795 2983.6539 2986.9232 2991.0552 2995.2848 3008.1566 3013.6063 3015.1942 3018.8573 3019.3532 3032.8157 3040.2053 3051.8365 3058.5610 3061.2222 3069.2721 3073.3843 3077.0428 3080.0630 3080.2610 3087.8274 3087.9392 3090.2986 3093.4156 3121.6874 3131.1339 3145.5455 3153.7781 3164.8772
redmass: 4.2538 3.1622 4.6056 5.4785 3.6385 2.3864 4.1486 3.1421 3.7093 4.1057 2.6374 2.9912 2.4185 1.7176 3.0595 1.1215 3.5616 2.5770 2.6464 2.3591 2.1760 3.1149 2.6770 3.0507 4.4902 2.2887 2.2259 2.6137 2.6514 2.4574 2.8254 2.9348 3.2578 2.6033 4.7402 6.4059 4.8966 4.7980 1.8875 3.2514 2.4962 2.9297 2.6154 1.1699 2.6112 2.1501 1.4414 1.3047 2.1598 2.4634 1.2582 2.5810 1.8977 2.5163 2.0728 1.4815 2.7261 2.5892 1.7350 2.0296 1.4620 2.5360 1.7697 3.7643 1.9097 1.8227 2.2103 2.2021 2.4050 2.4323 1.9321 1.6439 2.2206 2.0031 1.5424 2.4252 1.9290 1.1861 1.5183 1.8868 2.3412 1.8854 1.7605 1.0741 1.7071 1.1433 2.1248 2.5414 1.5048 1.3761 1.4764 1.4953 1.3634 1.3373 1.1538 1.7195 1.4837 1.1523 1.5547 1.4801 1.3147 1.3717 1.3549 1.2335 1.2896 1.2579 1.2927 7.0057 1.3292 1.2858 2.2363 1.0820 1.0601 1.0977 1.0517 1.0825 1.0587 1.0978 1.1836 1.0584 1.7857 1.0579 1.0759 1.1039 1.0786 5.9600 6.6907 8.6594 1.0714 1.0705 1.0347 1.0368 1.0627 1.0593 1.0597 1.0598 1.0633 1.0853 1.0594 1.0621 1.0896 1.0993 1.1022 1.0903 1.0989 1.0987 1.1050 1.0994 1.1036 1.1010 1.0992 1.1004 1.0927 1.1078 1.0845 1.0881 1.0924 1.0953 1.1008
irintensity: 0.1182 0.1444 0.3536 0.6732 0.0563 0.0269 0.1926 0.2287 0.0885 0.9349 0.4758 1.9621 1.5630 1.4996 2.0799 0.0350 2.7259 0.3127 0.7515 0.4967 2.9110 2.2888 3.4547 0.1552 12.1378 0.5004 1.4392 0.0887 1.8665 2.6217 5.0146 7.4825 2.1796 9.6686 6.9658 0.0405 12.7926 6.2634 53.3699 18.3650 4.3181 4.9345 6.9734 7.3994 5.9125 21.3618 5.4717 6.5154 6.1921 7.5787 0.2910 8.9439 2.2911 11.4892 10.0733 2.1737 2.6790 2.1145 2.7533 4.5372 0.0851 7.7908 9.4692 8.2789 4.2055 9.5054 30.3862 16.5859 37.2685 12.0809 94.3311 16.6430 3.3408 24.5179 7.2091 21.3333 10.7726 46.5880 52.0934 14.1810 33.7867 105.9310 17.5138 4.9034 10.8688 1.1934 19.1735 3.2403 4.8800 13.2145 6.3034 4.8009 4.5623 1.4475 7.7789 1.3813 4.9570 15.6806 3.8489 3.0885 2.7518 1.4709 9.1620 13.6067 3.0801 22.0079 3.8564 0.0787 12.8171 19.6835 9.0579 4.5958 7.2705 25.2135 14.4747 1.9838 6.1256 7.8177 25.1469 4.2417 11.8230 7.0349 12.4935 9.9949 1.7190 0.9326 46.3936 85.1054 67.4426 90.4437 23.9239 29.0390 20.1739 37.5464 37.2770 42.4571 53.5040 19.2791 41.2359 21.4640 2.2596 17.2828 10.6608 68.8404 32.6929 42.7082 15.7831 75.4867 100.9232 19.6905 17.8292 48.6031 14.8605 18.9086 0.5336 5.7397 24.5895 24.2747 11.2922
temp: 298.150 k
press: 1.00000 atm
elementType: 8 8 7 6 6 6 6 6 6 6 6 6 6 6 6 6 6 6 6 6 6 6 6 6 1 1 1 1 1 1 1 1 1 1 1 1 1 1 1 1 1 1 1 1 1 1 1 1 1 1 1 1 1 1 1
symmnumber: 1
zpe: 1253309.8 jmol-1
zpe.correction: 0.477361 hartree
zpe.thermalcorrener: 0.500847 hartree
zpe.thermalcorrenthalpy: 0.501791 hartree
zpe.thermalcorrgfe: 0.423234 hartree
zpe.sumelectzpe: -1022.164327 hartree
zpe.sumelectthermal: -1022.140841 hartree
zpe.sumelectthermalent: -1022.139897 hartree
zpe.sumelectthermalfe: -1022.218454 hartree
dipole: 0.2540 0.1585 -0.8881
dipole: 0.9372
quadrupole: -139.5282 -137.6954 -148.5767
quadrupole: 0.7672 1.8538 3.4864
quadrupole: 2.4052 4.2381 -6.6433 0.7672 1.8538 3.4864
hfenergy: -1022.6416877 hartree
pointgroup: C01 [X(C21H31N1O2)]
dipole: -0.0960473 -0.1124493 -0.3377792 debye
polarizability: 252.0615665|18.817719|230.9293294|7.331245|-9.2770023|199.5366701 unknown
InChI: InChI=1S/C21H31NO2/c1-3-22(4-2)13-8-14-24-20(23)21(18-9-6-5-7-10-18)16-17-11-12-19(21)15-17/h5-7,9-10,17,19H,3-4,8,11-16H2,1-2H3
charge 0 multiplicity 1
55 atoms
O  0.213822 1.866128 -0.700471
O  0.602946 1.774828 1.596962
N  -3.871404 0.245099 -0.25039
C  3.118032 0.441389 1.144915
C  4.185306 1.047971 -0.777098
C  1.967075 0.356417 0.072222
C  3.918814 1.668323 0.623131
C  2.743131 0.711993 -1.262287
C  4.138601 -0.714602 0.914402
C  4.897024 -0.28275 -0.395612
C  1.188773 -0.977786 0.052175
C  0.887904 1.408375 0.432766
C  0.947879 -1.681436 1.262544
C  0.632916 -1.493925 -1.146588
C  0.202385 -2.880533 1.269716
C  -0.112499 -2.694838 -1.143165
C  -0.949247 2.790084 -0.501872
C  -0.327181 -3.39747 0.064608
C  -2.25131 2.068109 -0.866828
C  -2.605175 0.927181 0.115198
C  -5.076714 1.009469 0.156803
C  -3.892225 -1.197719 0.104908
C  -6.376043 0.495164 -0.491492
C  -3.909881 -1.538811 1.621373
H  2.737888 0.524505 2.173811
H  4.749646 1.673376 -1.488713
H  3.327526 2.600938 0.593154
H  4.84297 1.851001 1.200015
H  2.75431 -0.138967 -1.965432
H  2.275809 1.566509 -1.777033
H  4.830082 -0.777357 1.774386
H  3.647631 -1.697049 0.814017
H  4.817529 -1.036645 -1.199497
H  5.971939 -0.113567 -0.200216
H  1.34136 -1.286799 2.20514
H  0.768499 -0.950648 -2.087243
H  0.034355 -3.409448 2.214816
H  -0.528634 -3.077267 -2.082196
H  -0.751219 3.636176 -1.181062
H  -0.94419 3.133695 0.548444
H  -0.903226 -4.32972 0.068114
H  -3.057414 2.829328 -0.8807
H  -2.183152 1.652842 -1.888867
H  -2.622812 1.334099 1.157539
H  -1.793429 0.177289 0.08437
H  -4.92404 2.058731 -0.159204
H  -5.20134 1.03631 1.269926
H  -2.997996 -1.659779 -0.354692
H  -4.769201 -1.661814 -0.383834
H  -6.260143 0.446536 -1.58892
H  -6.653175 -0.510803 -0.128535
H  -7.214857 1.175714 -0.255298
H  -3.90037 -2.63627 1.760798
H  -4.812806 -1.144303 2.123005
H  -3.021368 -1.127475 2.13409
