program: Orca
programVersion: 4.2.1
elementType: O O N N N C C C C C C C C C C C C C C C C C C C C H H H H H H H H H H H H H H H H H H H H H H H
charge: 0
multiplicity: 1
keywords: wb97x-d3
keywords: def2-TZVPP
keywords: def2/J RIJCOSX GRIDX6 NOFINALGRIDX
keywords: grid4 nofinalgrid
keywords: scfconv7
keywords: smallprint printgap noloewdin
keywords: NOSOSCF
formula: C20H23N3O2
InChI: InChI=1S/C20H23N3O2/c1-20(2,3)18(24)19(23-14-21-13-22-23)25-17-11-9-16(10-12-17)15-7-5-4-6-8-15/h4-14,18-19,24H,1-3H3
48 atoms
O  3.081751 2.36556 0.602832
O  1.08331 0.668915 0.884872
N  2.161042 -1.119962 -0.130508
N  1.978963 -1.788299 -1.274813
N  2.478871 -3.202739 0.392216
C  4.590086 0.879183 -0.497817
C  3.361935 0.996333 0.433059
C  2.063302 0.320065 -0.059118
C  4.302181 1.433158 -1.894192
C  5.725888 1.690728 0.139115
C  5.080747 -0.567153 -0.617344
C  -0.241745 0.529747 0.600775
C  2.457718 -1.97678 0.851577
C  -1.111151 0.897401 1.623982
C  -0.753812 0.062353 -0.602528
C  2.182853 -3.027407 -0.911747
C  -3.017447 0.311709 0.249192
C  -2.476452 0.789424 1.445885
C  -2.129269 -0.039992 -0.763518
C  -4.47588 0.166633 0.074015
C  -5.078673 0.384845 -1.166789
C  -5.288232 -0.20627 1.147228
C  -6.447209 0.229248 -1.329873
C  -6.65714 -0.357946 0.985294
C  -7.243201 -0.143215 -0.254838
H  3.633463 0.535319 1.395844
H  1.803884 0.672159 -1.060823
H  3.549825 0.850505 -2.42921
H  3.966176 2.470107 -1.864824
H  5.210003 1.403777 -2.499366
H  5.515464 2.758741 0.164991
H  6.644706 1.551775 -0.433019
H  5.927126 1.362246 1.161617
H  4.429187 -1.197603 -1.220437
H  5.210597 -1.038054 0.359577
H  6.054987 -0.57607 -1.109504
H  2.438588 2.460815 1.313063
H  2.642291 -1.678012 1.87124
H  -0.711597 1.274881 2.556574
H  -0.117985 -0.247014 -1.419826
H  2.111755 -3.841811 -1.614892
H  -3.129189 1.098654 2.252128
H  -2.504455 -0.43181 -1.700255
H  -4.477972 0.695872 -2.012376
H  -4.846954 -0.401963 2.116477
H  -6.893554 0.407146 -2.299502
H  -7.265659 -0.654505 1.829569
H  -8.310641 -0.265451 -0.382415
elementType: O N C H
totalener: -1090.77530598 hartree
nucrepener: 2132.91500358 hartree
electener: -3223.69030956 hartree
oneelecener: -5718.37586029 hartree
twoeener: 2494.68555073 hartree
cpcmener: -0.03294837 hartree
kineticenergy: 1086.00080171 hartree
xcener: -106.811681239038 hartree
chargesum: -0.0000000
charge: -0.424431 -0.326113 0.125111 -0.358052 -0.396533 0.261305 0.117540 0.041623 -0.361748 -0.335838 -0.375108 0.322773 0.059749 -0.271769 -0.203933 0.088609 0.107190 -0.150502 -0.213052 0.091970 -0.202053 -0.208565 -0.177142 -0.175185 -0.153241 0.129641 0.160623 0.090308 0.101522 0.102853 0.095882 0.094914 0.099314 0.100381 0.107293 0.104862 0.230139 0.183393 0.144643 0.136918 0.164641 0.147480 0.146624 0.146086 0.146088 0.161006 0.159940 0.162843
qa: -0.4244 -0.3261 0.1251 -0.3581 -0.3965 0.2613 0.1175 0.0416 -0.3617 -0.3358 -0.3751 0.3228 0.0597 -0.2718 -0.2039 0.0886 0.1072 -0.1505 -0.2131 0.0920 -0.2021 -0.2086 -0.1771 -0.1752 -0.1532 0.1296 0.1606 0.0903 0.1015 0.1029 0.0959 0.0949 0.0993 0.1004 0.1073 0.1049 0.2301 0.1834 0.1446 0.1369 0.1646 0.1475 0.1466 0.1461 0.1461 0.1610 0.1599 0.1628
va: 2.0139 2.0516 3.2822 2.8337 3.0482 3.6154 3.9470 3.9668 3.9385 3.9126 3.9571 3.7282 4.0742 4.0437 3.9206 4.0041 3.5751 3.9452 4.0186 3.5332 3.9341 3.9397 3.9141 3.9166 3.8811 0.9963 0.9827 1.0080 1.0178 1.0040 1.0179 1.0059 1.0029 1.0076 1.0040 1.0104 1.0162 0.9951 1.0106 1.0348 0.9936 1.0006 1.0042 1.0051 1.0052 0.9922 0.9926 0.9887
dispcorr: -0.024292502 hartree
energy: -1090.799598477795
dipole: 19.79220 -19.82811 -0.03591 6.85787 -6.19543 0.66244 -4.56803 5.11049 0.54246
magnitude: 0.85696 au
magnitude: 2.17822 debye
