program: Orca
programVersion: 4.2.1
elementType: O O N N N C C C C C C C C C C C C C C C C C C C C H H H H H H H H H H H H H H H H H H H H H H H
charge: 0
multiplicity: 1
keywords: wb97x-d3
keywords: def2-TZVPP
keywords: def2/J RIJCOSX GRIDX6 NOFINALGRIDX
keywords: grid4 nofinalgrid
keywords: scfconv7
keywords: smallprint printgap noloewdin
keywords: NOSOSCF
formula: C20H23N3O2
InChI: InChI=1S/C20H23N3O2/c1-20(2,3)18(24)19(23-14-21-13-22-23)25-17-11-9-16(10-12-17)15-7-5-4-6-8-15/h4-14,18-19,24H,1-3H3
48 atoms
O  3.040102 2.410532 0.395369
O  1.074736 0.705971 0.85541
N  2.185627 -1.145705 -0.001709
N  2.00988 -1.91601 -1.081503
N  2.536114 -3.168818 0.702502
C  4.574699 0.846844 -0.553344
C  3.344977 1.036247 0.363473
C  2.059368 0.293173 -0.057552
C  5.100177 -0.592013 -0.514148
C  4.269873 1.233677 -2.001458
C  5.691938 1.749883 -0.014937
C  -0.248124 0.549456 0.571774
C  2.499531 -1.906949 1.050386
C  -1.126842 1.040146 1.533648
C  -0.750268 -0.048846 -0.576472
C  2.238276 -3.114058 -0.611323
C  -3.021956 0.325585 0.204788
C  -2.491034 0.928578 1.348075
C  -2.124328 -0.152563 -0.745802
C  -4.479312 0.184346 0.019015
C  -5.0535 0.263602 -1.251794
C  -5.319295 -0.045894 1.110761
C  -6.420771 0.109772 -1.425825
C  -6.686987 -0.196328 0.937268
C  -7.244285 -0.122031 -0.332161
H  3.624594 0.680207 1.367583
H  1.788849 0.548868 -1.085135
H  6.07786 -0.630003 -0.997832
H  5.235074 -0.952153 0.508214
H  4.468105 -1.29922 -1.04932
H  5.178923 1.169902 -2.601726
H  3.895661 2.254274 -2.08681
H  3.539865 0.567866 -2.465762
H  5.451273 2.808851 -0.092142
H  6.60861 1.580516 -0.581872
H  5.912226 1.530837 1.03238
H  2.395954 2.566457 1.092375
H  2.683739 -1.5155 2.038165
H  -0.736014 1.516525 2.423651
H  -0.108142 -0.459391 -1.342566
H  2.176169 -3.988091 -1.239907
H  -3.149925 1.336033 2.103945
H  -2.491051 -0.645946 -1.636646
H  -4.430349 0.46338 -2.114636
H  -4.901701 -0.131523 2.106153
H  -6.843791 0.178655 -2.419468
H  -7.317649 -0.381347 1.796968
H  -8.310829 -0.242956 -0.468033
elementType: O N C H
totalener: -1090.77546292 hartree
nucrepener: 2132.55592997 hartree
electener: -3223.33139288 hartree
oneelecener: -5717.64123300 hartree
twoeener: 2494.30984012 hartree
cpcmener: -0.03290852 hartree
kineticenergy: 1086.00841483 hartree
xcener: -106.813251866297 hartree
chargesum: 0.0000000
charge: -0.423171 -0.326292 0.127190 -0.358744 -0.396501 0.262107 0.117700 0.040760 -0.376331 -0.363394 -0.334103 0.327829 0.059491 -0.275114 -0.202180 0.088412 0.108689 -0.149205 -0.217966 0.092039 -0.203733 -0.209203 -0.175934 -0.175078 -0.153307 0.129000 0.161556 0.105332 0.107681 0.100339 0.103023 0.102338 0.090093 0.095961 0.094744 0.098807 0.228959 0.183267 0.144402 0.136532 0.164171 0.147836 0.146656 0.146232 0.145860 0.160369 0.160043 0.162837
qa: -0.4232 -0.3263 0.1272 -0.3587 -0.3965 0.2621 0.1177 0.0408 -0.3763 -0.3634 -0.3341 0.3278 0.0595 -0.2751 -0.2022 0.0884 0.1087 -0.1492 -0.2180 0.0920 -0.2037 -0.2092 -0.1759 -0.1751 -0.1533 0.1290 0.1616 0.1053 0.1077 0.1003 0.1030 0.1023 0.0901 0.0960 0.0947 0.0988 0.2290 0.1833 0.1444 0.1365 0.1642 0.1478 0.1467 0.1462 0.1459 0.1604 0.1600 0.1628
va: 2.0147 2.0512 3.2826 2.8325 3.0479 3.6126 3.9452 3.9633 3.9582 3.9384 3.9133 3.7277 4.0753 4.0463 3.9189 4.0046 3.5752 3.9452 4.0243 3.5340 3.9358 3.9423 3.9139 3.9175 3.8818 0.9968 0.9832 1.0101 1.0038 1.0070 1.0041 1.0178 1.0086 1.0183 1.0058 1.0030 1.0170 0.9950 1.0108 1.0360 0.9939 1.0005 1.0043 1.0049 1.0054 0.9924 0.9925 0.9887
dispcorr: -0.024290404 hartree
energy: -1090.799753323085
dipole: 19.65145 -19.69170 -0.04025 6.65207 -5.92594 0.72613 -5.18665 5.66938 0.48273
magnitude: 0.87288 au
magnitude: 2.21868 debye
