program: Gaussian 09
title: 000030111
version: EM64L-G09RevD.01
frameworkgroup: C1[X(C10H22O4)]
method: RPBEPBE
basis: SDD
operation: Freq
keyword: #pfreq=noraman
keyword: PBEPBE/SDD
title: #p freq=noraman PBEPBE/SDD
converged: YES YES NO NO
title: Mulliken charges:
elementType: O O O O C C C C C C C C C C H H H H H H H H H H H H H H H H H H H H H H
charge: -0.287677 -0.277110 -0.273392 -0.460456 0.018592 -0.265369 0.074801 -0.236642 -0.692661 -0.062435 -0.294042 -0.718773 -0.702072 -0.498308 0.161061 0.219321 0.159895 0.199236 0.175646 0.205603 0.264633 0.198220 0.208270 0.213151 0.209398 0.181980 0.220707 0.211642 0.224766 0.214569 0.208574 0.227803 0.338718 0.230130 0.193911 0.208309
chargesum: 0.00000
title: Mulliken charges with hydrogens summed into heavy atoms:
elementType: O O O O C C C C C C C C C C
charge: -0.287677 -0.277110 -0.273392 -0.121738 0.179653 0.113846 0.274037 0.144607 -0.021539 0.150717 0.097336 -0.061657 -0.051127 0.134043
polarizability: 1.42178746e+02 -5.82847542e+00 1.30008617e+02 3.85519826e+00 7.01567090e-01 1.06773865e+02
1716.lowfreq: -11.5910 -2.1023 -0.0005 0.0002 0.0006 1.7834 6.3567 18.1512 23.0572
frequency: 2.9994 17.6132 22.9022 37.9225 52.9580 77.2780 95.9805 107.6842 137.2184 149.0976 167.2564 180.3326 197.7665 212.7243 225.2278 237.1795 255.9653 280.7786 320.5533 331.2745 356.0606 386.1036 395.5122 457.4000 469.5502 482.8796 507.8894 619.1955 785.8810 819.0562 831.9243 869.5683 886.3308 905.0484 910.8502 929.4494 936.5339 939.6028 993.6602 1025.7803 1061.7059 1066.8016 1077.4852 1083.0380 1093.8720 1098.2715 1112.0930 1114.3755 1117.4915 1136.4332 1151.4744 1176.4921 1192.4617 1218.5387 1234.4141 1249.1883 1291.2722 1295.6641 1313.8205 1318.2939 1333.9425 1356.9680 1371.6929 1380.8386 1383.7210 1385.0018 1393.8453 1403.1323 1435.6249 1453.2726 1457.1280 1458.1861 1459.5650 1466.6793 1467.4754 1468.7308 1473.5589 1474.3181 1475.7750 1479.3501 2898.0176 2916.7028 2920.4378 2925.7697 2927.4591 2963.3277 2977.8385 2981.5492 2981.6738 2987.0098 2988.4604 2991.7888 2994.4952 3001.1420 3074.3121 3077.2067 3079.1580 3084.7802 3085.2203 3099.3843 3121.3282 3576.8048
redmass: 3.4486 3.2424 3.8952 3.8100 3.3066 3.1843 2.5614 2.4976 2.0798 1.8948 1.7195 2.4078 1.1450 1.2500 1.2536 1.2013 2.3106 3.6755 2.9586 2.7953 2.3535 2.5979 2.7488 2.7094 3.2670 2.9010 2.8826 2.8397 3.7698 2.7442 2.5083 2.5086 2.5576 2.1021 1.8316 1.6753 1.7163 1.6694 2.3224 5.6091 1.8107 4.3357 2.0605 2.2473 2.1436 2.2107 2.0704 1.9170 1.4865 1.7111 2.1036 1.6763 1.1440 1.1320 1.1152 1.1485 1.3546 1.3024 1.2891 1.2455 1.4641 1.3573 1.3228 1.2913 1.2434 1.2342 1.3588 1.5088 1.1446 1.0679 1.0664 1.0640 1.0781 1.0601 1.0645 1.0595 1.0593 1.0510 1.0662 1.0675 1.0747 1.0430 1.0665 1.0610 1.0510 1.0849 1.0485 1.0724 1.0376 1.0992 1.0980 1.0416 1.1021 1.0952 1.0990 1.0988 1.0984 1.0999 1.1001 1.0969 1.0991 1.0665
irintensity: 1.4266 0.3830 0.7029 1.7812 3.3668 7.8565 8.2869 10.1109 25.8580 38.8721 88.6867 4.7856 0.4462 1.7851 1.9797 1.0340 0.9772 1.1737 4.0263 0.1991 1.3890 1.5157 16.1351 6.5229 11.5383 3.0842 2.7802 1.4786 8.7924 13.5697 19.5495 18.7875 7.0658 4.7149 19.6280 6.6724 2.5154 1.3930 115.2503 132.1948 33.6124 90.8982 31.1412 45.8471 41.5253 44.7289 6.6841 22.5815 13.7504 4.6759 31.1823 15.7618 2.3106 6.7332 13.6325 17.7887 3.5659 17.4237 34.0347 8.5058 19.5516 4.9169 6.1587 30.7039 14.6396 20.2943 11.3680 2.8894 1.5695 4.5506 10.7426 8.7879 3.8038 7.2079 9.7171 19.5500 8.6174 6.8493 20.2619 3.1164 5.6561 57.8924 77.6445 203.2126 31.4974 21.1189 37.1980 9.4337 17.4623 96.5138 37.0420 21.2089 50.2963 63.8041 42.2670 58.4915 33.3600 37.5207 33.9239 33.1388 15.8635 4.8190
temp: 298.150 k
press: 1.00000 atm
elementType: 8 8 8 8 6 6 6 6 6 6 6 6 6 6 1 1 1 1 1 1 1 1 1 1 1 1 1 1 1 1 1 1 1 1 1 1
symmnumber: 1
zpe: 814985.0 jmol-1
zpe.correction: 0.310411 hartree
zpe.thermalcorrener: 0.329554 hartree
zpe.thermalcorrenthalpy: 0.330498 hartree
zpe.thermalcorrgfe: 0.257840 hartree
zpe.sumelectzpe: -693.899781 hartree
zpe.sumelectthermal: -693.880638 hartree
zpe.sumelectthermalent: -693.879694 hartree
zpe.sumelectthermalfe: -693.952352 hartree
dipole: 0.4323 -0.1030 -0.9483
dipole: 1.0473
quadrupole: -75.7092 -74.0360 -89.0192
quadrupole: -2.8402 7.6208 5.8499
quadrupole: 3.8789 5.5522 -9.4310 -2.8402 7.6208 5.8499
hfenergy: -694.2101922 hartree
pointgroup: C01 [X(C10H22O4)]
dipole: 0.1461972 -0.0906679 -0.3744123 debye
polarizability: 142.2125464|-5.8298913|130.1985791|2.4530188|-1.914906|106.550102 unknown
InChI: InChI=1S/C10H22O4/c1-8(11)5-13-10(3)7-14-9(2)6-12-4/h8-11H,5-7H2,1-4H3
charge 0 multiplicity 1
36 atoms
O  1.44211 -0.773763 0.235852
O  -1.514779 -0.369267 -0.089913
O  2.923778 1.695927 -0.791788
O  -3.477529 1.386711 1.478854
C  -0.835464 -1.670513 0.080264
C  0.53406 -1.555031 -0.602554
C  2.811289 -0.673355 -0.311856
C  -2.974032 -0.449631 0.014848
C  -0.736907 -2.070196 1.564234
C  -3.517413 0.980177 0.05554
C  3.365951 0.67272 0.158213
C  3.666727 -1.863302 0.167359
C  -4.954251 1.082541 -0.490373
C  3.136378 3.049394 -0.290184
H  -1.406936 -2.445278 -0.485518
H  0.405618 -1.060043 -1.588168
H  0.936001 -2.58197 -0.763574
H  2.769136 -0.651737 -1.422301
H  -3.383812 -0.998588 -0.863175
H  -3.294594 -0.968949 0.941781
H  -0.166387 -1.304253 2.111541
H  -0.216527 -3.040514 1.670532
H  -1.738647 -2.164756 2.018772
H  -2.831772 1.614541 -0.544205
H  2.975451 0.881735 1.1777
H  4.47859 0.648809 0.19728
H  3.188582 -2.822305 -0.101289
H  4.670219 -1.841796 -0.297318
H  3.78565 -1.838783 1.265652
H  -5.333687 2.117238 -0.403702
H  -4.997613 0.792964 -1.557168
H  -5.63256 0.423855 0.081747
H  -3.485506 2.374645 1.536532
H  2.768678 3.731159 -1.073491
H  4.212699 3.256557 -0.100232
H  2.5687 3.226657 0.648109
