program: Gaussian 09
title: 000030273
version: EM64L-G09RevD.01
frameworkgroup: C1[X(C14H21NO2)]
method: RPBEPBE
basis: SDD
operation: Freq
keyword: #p
keyword: freq=noraman
keyword: PBEPBE/SDD
title: #p freq=noraman PBEPBE/SDD
converged: YES YES NO NO
title: Mulliken charges:
elementType: O O N C C C C C C C C C C C C C C H H H H H H H H H H H H H H H H H H H H H
charge: -0.255800 -0.206550 -0.096166 -0.364008 -0.272137 -0.489426 0.199732 0.237857 0.116906 -0.361081 -0.351517 -0.357873 -0.615670 -0.643627 -0.692155 -0.266029 -0.228029 0.202260 0.195524 0.195853 0.228842 0.244166 0.220199 0.230556 0.196565 0.228895 0.254722 0.187079 0.224139 0.217003 0.178445 0.311967 0.211148 0.245760 0.215416 0.196891 0.231634 0.228510
chargesum: 0.00000
title: Mulliken charges with hydrogens summed into heavy atoms:
elementType: O O N C C C C C C C C C C C C C C
charge: -0.255800 -0.206550 -0.096166 0.033777 0.152558 -0.025061 0.199732 0.237857 0.116906 0.066039 -0.122622 -0.103151 0.012552 0.057933 -0.034088 -0.034395 0.000481
polarizability: 1.99653235e+02 6.81749005e+00 1.95569083e+02 -4.21818937e+00 -3.70248447e+00 1.10456131e+02
1716.lowfreq: -8.9229 -7.9122 -0.8614 -0.0005 -0.0003 0.0006 15.8030 27.6517 37.4985
frequency: 13.6191 27.5157 37.4758 49.4608 57.9284 96.6725 109.7613 114.3008 133.6976 181.3103 208.7836 224.3132 225.5984 233.3821 249.9071 275.3987 283.8430 292.3892 356.6390 374.5832 381.8499 412.4505 424.1544 487.9657 499.9610 542.5846 573.9027 597.4887 630.9783 703.0584 739.8961 751.8371 758.1949 766.8389 812.1515 848.0460 866.5962 881.9960 901.8303 937.3800 952.6334 972.9296 977.2588 1000.6012 1037.2582 1042.8635 1054.8513 1061.8345 1067.0426 1088.9523 1096.3087 1108.6100 1128.3671 1138.3132 1173.4456 1176.2125 1208.8247 1210.8463 1222.8093 1226.7905 1265.1354 1273.4036 1277.3922 1306.0054 1336.0606 1343.0730 1359.8402 1371.8377 1383.9016 1384.5069 1422.4204 1425.5712 1429.2780 1437.3646 1449.5803 1456.9592 1457.1722 1462.0672 1471.1185 1474.6964 1478.1771 1485.1453 1487.5986 1493.7463 1572.5239 1595.8028 1604.1067 2844.9444 2860.4537 2874.1906 2953.3172 2960.7373 2975.3467 2995.6414 3013.5148 3019.3700 3022.9679 3030.7841 3036.2166 3048.8516 3071.8849 3072.8469 3087.3520 3117.2135 3132.3110 3141.8473 3163.0016 3174.9586
redmass: 2.6918 3.4453 3.5879 3.3585 3.9953 3.1774 2.9578 3.6989 3.5297 2.0471 1.8661 3.2559 1.4727 1.2143 2.1504 1.8481 2.1325 4.6644 1.9827 3.1381 3.6009 2.1829 3.3982 2.7997 3.3815 3.9031 3.0306 4.2866 3.7966 2.6387 2.3909 2.9273 1.6606 3.2851 1.8710 1.5610 2.1981 2.1564 2.9849 1.4095 2.0512 3.3707 1.3313 3.0211 1.5564 2.0314 1.7406 1.5036 1.9914 1.2765 2.1996 2.2057 1.8335 1.4672 1.8805 1.0973 2.3055 1.4931 1.4483 2.4493 1.3064 2.4430 1.5105 1.2922 1.5005 1.5203 1.5670 1.6432 1.5346 2.0156 1.1602 1.3823 1.5131 1.1141 1.2135 1.1115 1.0796 1.0957 1.1079 1.0744 1.6491 1.1011 1.0506 1.0524 6.7471 7.4551 6.8582 1.0578 1.0610 1.0650 1.0582 1.0646 1.0367 1.0621 1.0719 1.0872 1.0932 1.0769 1.1046 1.0983 1.0992 1.1008 1.1005 1.0986 1.0852 1.0902 1.0948 1.0977
irintensity: 0.3735 1.6580 0.2616 0.9015 1.2783 1.9468 1.2662 1.1350 2.7437 0.6838 2.0832 3.3490 0.4340 1.1844 1.1980 7.5812 1.4022 3.2662 5.6062 0.6210 5.8894 0.2642 2.1946 2.5780 7.1901 0.9679 4.5135 9.3125 6.9889 5.5384 10.7677 6.3041 89.9412 12.2753 18.2846 1.9408 5.8371 28.8544 24.0202 3.5432 17.3067 32.4743 0.9570 66.2163 14.6383 8.8230 10.6345 5.5735 8.7069 10.8386 12.8703 9.9906 28.6991 1.3876 6.9585 11.5765 72.2090 24.0304 31.1647 173.6957 32.9453 9.2815 32.7195 13.3246 21.9198 15.8952 5.2316 8.9860 7.4276 18.5982 2.8230 16.6044 59.5902 3.8771 37.1128 20.1601 17.9611 6.5141 7.9185 7.3767 78.3184 6.7087 11.8570 29.5422 64.7559 17.3680 166.3468 105.4383 75.2294 164.0144 40.3755 25.7896 33.7718 38.4443 45.3804 44.3832 12.6253 47.1372 38.1381 5.5025 52.0727 41.9563 48.2361 1.9709 1.2164 15.2776 28.9864 12.4058
temp: 298.150 k
press: 1.00000 atm
elementType: 8 8 7 6 6 6 6 6 6 6 6 6 6 6 6 6 6 1 1 1 1 1 1 1 1 1 1 1 1 1 1 1 1 1 1 1 1 1
symmnumber: 1
zpe: 844053.5 jmol-1
zpe.correction: 0.321483 hartree
zpe.thermalcorrener: 0.340265 hartree
zpe.thermalcorrenthalpy: 0.341209 hartree
zpe.thermalcorrgfe: 0.272051 hartree
zpe.sumelectzpe: -749.936088 hartree
zpe.sumelectthermal: -749.917306 hartree
zpe.sumelectthermalent: -749.916362 hartree
zpe.sumelectthermalfe: -749.985519 hartree
dipole: 0.2365 2.4531 1.9480
dipole: 3.1413
quadrupole: -88.5809 -96.2580 -106.1945
quadrupole: -0.6623 -2.9460 -1.9084
quadrupole: 8.4303 0.7532 -9.1834 -0.6623 -2.9460 -1.9084
hfenergy: -750.2575707 hartree
pointgroup: C01 [X(C14H21N1O2)]
dipole: -0.69479 -0.6594108 0.7809597 debye
polarizability: 204.8364041|-1.3619465|190.6181028|3.0338912|0.5229365|110.2239421 unknown
InChI: InChI=1S/C14H21NO2/c1-4-7-13(16)12-8-5-6-9-14(12)17-11-10-15(2)3/h5-6,8-9H,4,7,10-11H2,1-3H3
charge 0 multiplicity 1
38 atoms
O  0.563357 -1.055533 0.117659
O  0.672296 1.639636 -0.738536
N  3.454658 -1.899364 -0.749534
C  2.66324 -2.263376 0.445511
C  1.163538 -2.406539 0.171668
C  -0.922409 2.780938 0.711097
C  -1.333177 0.384876 -0.221609
C  -0.796931 -0.944035 -0.158712
C  -0.443337 1.599868 -0.146696
C  -0.15172 4.092398 0.456299
C  -2.728681 0.535732 -0.42613
C  -1.65095 -2.064656 -0.325595
C  4.854975 -2.360842 -0.65831
C  3.378432 -0.459404 -1.098985
C  -0.498197 4.734973 -0.90493
C  -3.57943 -0.576967 -0.600412
C  -3.031359 -1.876965 -0.550976
H  2.805054 -1.551176 1.29752
H  3.014709 -3.255193 0.79191
H  0.676073 -2.979981 0.988313
H  1.013367 -2.922989 -0.796316
H  -0.79807 2.454761 1.766818
H  -2.011496 2.934566 0.58482
H  0.932384 3.878316 0.491412
H  -0.37532 4.804049 1.274751
H  -3.151045 1.544224 -0.489525
H  -1.248837 -3.080108 -0.281369
H  5.437992 -1.86616 0.160961
H  5.371718 -2.145551 -1.610946
H  4.887535 -3.453458 -0.493471
H  3.909061 0.187135 -0.354629
H  2.332837 -0.120937 -1.146008
H  3.848316 -0.300832 -2.086663
H  -0.23745 4.05417 -1.734168
H  0.062099 5.676004 -1.053361
H  -1.577678 4.970902 -0.974484
H  -4.649384 -0.430331 -0.777968
H  -3.676971 -2.75195 -0.686206
