program: Orca
programVersion: 4.2.1
elementType: O O N N N C C C C C C C C C C C C C C C C C C C C H H H H H H H H H H H H H H H H H H H H H H H
charge: 0
multiplicity: 1
keywords: wb97x-d3
keywords: def2-TZVPP
keywords: def2/J RIJCOSX GRIDX6 NOFINALGRIDX
keywords: grid4 nofinalgrid
keywords: scfconv7
keywords: smallprint printgap noloewdin
keywords: NOSOSCF
formula: C20H23N3O2
InChI: InChI=1S/C20H23N3O2/c1-20(2,3)18(24)19(23-14-21-13-22-23)25-17-11-9-16(10-12-17)15-7-5-4-6-8-15/h4-14,18-19,24H,1-3H3
48 atoms
O  3.881524 0.379306 1.441095
O  1.2980 0.403296 0.591924
N  2.246748 -1.639976 -0.015967
N  2.569537 -2.143878 1.180218
N  2.225396 -3.790289 -0.291945
C  3.866312 1.811447 -0.480114
C  3.621227 0.387749 0.065267
C  2.231551 -0.202651 -0.240818
C  5.343458 2.142016 -0.233226
C  3.615767 1.838065 -1.988892
C  3.005299 2.87945 0.197402
C  -0.034125 0.321155 0.344191
C  2.051322 -2.636039 -0.88517
C  -0.615727 -0.371327 -0.710001
C  -0.844943 1.012599 1.241249
C  2.540685 -3.434094 0.96847
C  -2.824709 0.304668 0.040826
C  -1.997971 -0.375786 -0.847152
C  -2.216838 1.005156 1.085814
C  -4.292903 0.286163 -0.109093
C  -5.045499 1.445231 0.088579
C  -4.962673 -0.891814 -0.444382
C  -6.425982 1.42656 -0.043392
C  -6.343403 -0.910738 -0.575338
C  -7.081126 0.248152 -0.374715
H  4.322828 -0.268633 -0.475797
H  1.997729 -0.072623 -1.301572
H  5.594554 3.104764 -0.682548
H  5.579643 2.206455 0.828927
H  6.004161 1.393205 -0.677285
H  3.93607 2.794843 -2.405134
H  2.560403 1.727585 -2.246989
H  4.172093 1.056079 -2.511946
H  1.949208 2.797774 -0.059038
H  3.333738 3.870695 -0.123283
H  3.090317 2.846547 1.28379
H  3.748328 -0.516421 1.78075
H  1.793125 -2.474958 -1.920485
H  -0.032351 -0.905544 -1.445901
H  -0.391623 1.550912 2.064175
H  2.754357 -4.145301 1.750912
H  -2.428359 -0.912883 -1.683201
H  -2.824974 1.537535 1.806487
H  -4.54762 2.376997 0.328263
H  -4.40316 -1.809254 -0.581277
H  -6.99035 2.338034 0.106814
H  -6.844768 -1.836973 -0.825541
H  -8.158698 0.232975 -0.474771
elementType: O N C H
totalener: -1090.78571537 hartree
nucrepener: 2136.75688667 hartree
electener: -3227.54260204 hartree
oneelecener: -5726.13521574 hartree
twoeener: 2498.59261369 hartree
cpcmener: -0.03120126 hartree
kineticenergy: 1086.00928279 hartree
xcener: -106.813290852941 hartree
chargesum: -0.0000000
charge: -0.419426 -0.276873 0.115718 -0.388339 -0.403918 0.235194 0.094835 0.063434 -0.337940 -0.364169 -0.338343 0.330815 0.084235 -0.219412 -0.252945 0.092690 0.114745 -0.226511 -0.146781 0.104065 -0.214397 -0.209906 -0.169139 -0.172285 -0.151290 0.118264 0.156316 0.094145 0.100185 0.094746 0.100463 0.094908 0.108302 0.087683 0.099245 0.097604 0.224578 0.180060 0.136536 0.139672 0.165950 0.146789 0.146425 0.145639 0.145676 0.156696 0.157455 0.158607
qa: -0.4194 -0.2769 0.1157 -0.3883 -0.4039 0.2352 0.0948 0.0634 -0.3379 -0.3642 -0.3383 0.3308 0.0842 -0.2194 -0.2529 0.0927 0.1147 -0.2265 -0.1468 0.1041 -0.2144 -0.2099 -0.1691 -0.1723 -0.1513 0.1183 0.1563 0.0941 0.1002 0.0947 0.1005 0.0949 0.1083 0.0877 0.0992 0.0976 0.2246 0.1801 0.1365 0.1397 0.1659 0.1468 0.1464 0.1456 0.1457 0.1567 0.1575 0.1586
va: 2.0252 2.1220 3.3003 2.8722 3.0396 3.6721 3.9423 3.9853 3.9203 3.9362 3.9445 3.7049 4.0471 3.9539 4.0377 4.0128 3.5622 4.0362 3.9290 3.5066 3.9453 3.9420 3.9199 3.9214 3.8903 1.0006 0.9758 1.0061 1.0161 1.0042 1.0055 1.0018 1.0038 1.0060 1.0046 1.0219 1.0482 0.9889 1.0198 1.0127 0.9912 1.0036 1.0010 1.0052 1.0047 0.9933 0.9930 0.9902
dispcorr: -0.023856013 hartree
energy: -1090.809571388083
dipole: 13.53297 -13.79317 -0.26020 15.88418 -15.50416 0.38002 -7.12097 5.56293 -1.55804
magnitude: 1.62469 au
magnitude: 4.12962 debye
