program: Gaussian 09
title: 000030091
version: EM64L-G09RevD.01
frameworkgroup: C1[X(C12H10O3)]
method: RPBEPBE
basis: SDD
operation: Freq
keyword: #pfreq=noraman
keyword: PBEPBE/SDD
title: #p freq=noraman PBEPBE/SDD
converged: YES YES NO NO
title: Mulliken charges:
elementType: O O O C C C C C C C C C C C C H H H H H H H H H H
charge: -0.260203 -0.132508 -0.172698 0.366066 0.191752 0.469882 -0.342989 -0.537853 0.130985 -0.391077 -0.371269 0.063530 -0.801151 0.114889 -0.797746 0.261610 0.274054 0.239475 0.239756 0.237500 0.235710 0.238747 0.235983 0.270133 0.237422
chargesum: 0.00000
title: Mulliken charges with hydrogens summed into heavy atoms:
elementType: O O O C C C C C C C C C C C C
charge: -0.260203 -0.132508 -0.172698 0.366066 0.191752 0.469882 -0.081379 -0.263799 0.130985 -0.151602 -0.131513 0.063530 -0.089194 0.114889 -0.054208
polarizability: 2.58181591e+02 -1.46345559e+01 1.41583335e+02 -2.37543531e-01 2.24611328e-01 6.38123183e+01
1716.lowfreq: -0.0009 0.0001 0.0003 6.5614 11.0934 14.0027 16.0331 29.9564 52.1812
frequency: 15.7917 29.8528 52.0813 84.0717 152.0255 168.7309 176.6984 240.7672 247.4065 294.4442 299.9808 362.4756 376.3309 412.5630 429.2973 453.9065 498.8448 527.1267 565.5108 592.7353 595.4799 621.6234 706.0991 731.0527 751.9722 752.9003 815.9490 819.7325 825.5391 890.0998 934.1068 937.2280 949.4390 968.9618 1010.2189 1023.8980 1045.9223 1061.3873 1134.0052 1162.3176 1212.6489 1249.0417 1274.2192 1286.9898 1353.8292 1372.4884 1394.1739 1401.3475 1418.9690 1452.3440 1466.6661 1468.6157 1472.3154 1495.3867 1544.7746 1587.4346 1601.1746 1626.1941 1716.3216 2981.5070 2984.7272 3058.8176 3072.0212 3097.5702 3125.2816 3127.2254 3143.5739 3151.3780 3164.1168
redmass: 7.3315 1.0410 3.7673 6.7351 4.5727 1.7584 1.5368 5.4557 4.2122 7.7669 5.1911 4.5807 3.7081 3.5473 8.7452 2.8928 4.8639 5.6407 3.3743 5.0649 3.6644 6.4568 7.2195 5.3752 4.4697 6.0835 1.3009 6.6836 4.6967 1.4085 1.4384 2.4601 2.9571 1.3864 1.5646 1.7992 1.5779 2.4553 1.9098 1.6689 1.8095 3.3566 2.1424 2.1764 2.0526 1.3988 2.1653 1.6197 5.5612 1.0923 1.0455 1.0501 1.1783 3.1190 6.6463 8.4202 6.1818 6.9305 12.6670 1.0380 1.0377 1.0970 1.0975 1.0988 1.0987 1.0875 1.0909 1.0972 1.0931
irintensity: 1.8888 0.4181 0.9070 0.0585 1.4746 2.7886 0.3710 0.0211 0.7891 1.3712 0.8138 1.0732 6.2168 2.1240 0.2411 7.2118 21.2889 1.6105 0.0808 13.0814 10.4445 16.4241 2.1213 5.9319 14.5550 36.4758 32.6141 10.5745 16.1108 13.8042 17.8831 17.9927 7.4331 6.0909 31.5692 1.8955 15.1927 9.1005 31.1666 7.2044 241.2917 64.3888 12.9913 25.0962 6.3803 64.8648 28.4200 3.8733 14.9204 14.9371 15.0343 21.3243 29.3692 8.3303 157.6031 124.5162 12.5679 287.8643 439.9479 18.7972 3.9745 14.6457 14.1260 16.3852 12.5480 3.6658 6.3527 19.7373 2.5970
temp: 298.150 k
press: 1.00000 atm
elementType: 8 8 8 6 6 6 6 6 6 6 6 6 6 6 6 1 1 1 1 1 1 1 1 1 1
symmnumber: 1
zpe: 490586.9 jmol-1
zpe.correction: 0.186855 hartree
zpe.thermalcorrener: 0.200520 hartree
zpe.thermalcorrenthalpy: 0.201465 hartree
zpe.thermalcorrgfe: 0.144389 hartree
zpe.sumelectzpe: -687.892247 hartree
zpe.sumelectthermal: -687.878582 hartree
zpe.sumelectthermalent: -687.877637 hartree
zpe.sumelectthermalfe: -687.934713 hartree
dipole: -6.3761 6.3969 0.1986
dipole: 9.0341
quadrupole: -87.0175 -87.4476 -87.8708
quadrupole: 14.8533 1.2989 0.1277
quadrupole: 0.4278 -0.0023 -0.4255 14.8533 1.2989 0.1277
hfenergy: -688.079102 hartree
pointgroup: C01[X(C12H10O3)]
dipole: 2.5570145 2.463967 -0.1533053 debye
dipolederiv: -1.1712612 -0.5260046 0.0009916 -0.1046105 -0.482101 -0.0059801 0.0114405 -0.0007992 -0.2121974 -0.6821658 -0.3277631 -0.014386 -0.6480774 -0.9378229 -0.0130713 -0.0304091 -0.0307883 -0.2885387 -1.0906287 -0.0886966 0.0759151 -0.1789219 -0.4989749 0.0524322 0.0790204 0.0409764 -0.3000433 -0.9982864 0.0483764 0.0400063 0.2455318 -0.2320018 -0.0152516 0.0370608 -0.0044045 -0.0143692 0.7232054 0.372263 -0.0102905 -0.0627908 0.4347701 0.0168845 -0.0176903 -0.0056484 0.1510683 0.634225 -0.0407616 -0.0261026 -0.3056158 0.2021963 0.0151801 -0.0354698 0.0064372 -0.0045817 1.2600145 0.0731673 -0.0501413 0.177411 0.1818066 -0.007598 -0.0728019 0.0087309 -0.0529843 -0.556405 -0.1951824 0.0105097 -0.1750123 0.0101914 0.0085461 0.0170445 0.0095389 -0.1803524 -1.240742 0.103808 0.0652868 -0.3632122 -0.5465538 0.0081491 0.0431408 -0.0126639 -0.0396109 0.5441715 -0.0506636 -0.0254564 0.239246 0.1328243 -0.00596 -0.0160669 0.0056427 -0.123693 -0.4656375 0.1646883 0.0126511 0.5576674 -0.0937088 -0.0219245 0.0171664 -0.0057617 -0.1882489 1.3114077 0.5693224 0.0202583 0.686398 1.2677768 0.0353058 0.0440698 0.0398708 0.2777589 -0.3337615 0.0525983 0.0169848 -0.0817056 0.0717514 0.0029824 0.0314094 -0.0031204 0.0473208 1.8793009 -0.2089665 -0.1416799 -0.4080744 0.8709018 -0.0656826 -0.1207698 -0.0512152 0.1433032 -0.116199 0.1049998 0.0052185 0.2751135 -0.4528173 0.0164991 0.0053 0.01352 0.0589631 0.1173496 0.007431 0.0023867 0.0773422 -0.0557758 -0.0073598 0.0038593 -0.0073365 0.1230897 0.0749648 0.0309527 0.0034476 0.0546746 -0.0171346 -0.0044484 0.0024076 -0.0040734 0.1686758 0.068746 0.0805642 0.0039114 0.0206146 -0.0706483 -0.0038016 0.0031209 -0.0065518 0.1512072 -0.0420064 -0.1022925 0.005813 -0.0998571 0.009515 0.0018907 0.0047228 0.0015918 0.1578292 -0.0165881 -0.0082013 -0.0630063 0.0075179 0.0618794 -0.0920399 -0.1182128 -0.0610291 -0.016572 0.0660968 -0.0282247 0.0021528 0.0969062 -0.1224298 0.0002713 -0.0026786 0.0039458 0.1138198 -0.004297 -0.0012025 0.0617659 0.0206724 0.0685913 0.0859735 0.1122839 0.0584904 -0.037071 0.0671058 -0.0546195 -0.0996919 -0.0163283 0.0458978 -0.0480202 -0.0720878 -0.0656983 -0.0154101 -0.1004868 0.0590794 0.0023943 -0.0062902 0.0968194 0.0041665 0.0054218 0.0053446 0.1221048 0.0718773 -0.0346721 0.101061 -0.008599 0.0550475 0.0428567 0.0687182 0.0650012 -0.041468 unknown
polarizability: 258.3847516|12.1833175|141.0074927|-8.412388|0.3395478|64.1849993 unknown
InChI: InChI=1S/C12H10O3/c1-7-3-4-9-6-10(8(2)13)12(14)15-11(9)5-7/h3-6H,1-2H3
charge 0 multiplicity 1
25 atoms
O  0.040642 -1.625327 0.051034
O  -2.146945 -2.333123 0.057584
O  -4.133194 -0.347794 0.456691
C  0.634824 0.746832 0.068354
C  1.007485 -0.630473 0.036863
C  3.379248 -0.049837 -0.035536
C  -0.764187 1.064314 0.133731
C  2.361335 -1.026931 -0.01225
C  -1.76732 0.100486 0.164038
C  1.673494 1.72547 0.04533
C  3.016228 1.335499 -0.006111
C  -1.419161 -1.337035 0.095087
C  4.840182 -0.449604 -0.094385
C  -3.215285 0.498506 0.277967
C  -3.557345 1.990549 0.184631
H  -1.04235 2.123393 0.171978
H  2.596615 -2.095158 -0.03391
H  1.404854 2.788159 0.07026
H  3.8069 2.093833 -0.023239
H  5.401128 -0.03117 0.762117
H  4.965646 -1.544578 -0.08168
H  5.319532 -0.062642 -1.013356
H  -3.141157 2.554974 1.040431
H  -4.653253 2.086739 0.205818
H  -3.173515 2.446419 -0.746246
