program: Orca
programVersion: 4.2.1
elementType: O O N N N C C C C C C C C C C C C C C C C C C C C H H H H H H H H H H H H H H H H H H H H H H H
charge: 0
multiplicity: 1
keywords: wb97x-d3
keywords: def2-TZVPP
keywords: def2/J RIJCOSX GRIDX6 NOFINALGRIDX
keywords: grid4 nofinalgrid
keywords: scfconv7
keywords: smallprint printgap noloewdin
keywords: NOSOSCF
formula: C20H23N3O2
InChI: InChI=1S/C20H23N3O2/c1-20(2,3)18(24)19(23-14-21-13-22-23)25-17-11-9-16(10-12-17)15-7-5-4-6-8-15/h4-14,18-19,24H,1-3H3
48 atoms
O  3.999954 0.138714 1.266466
O  1.339886 0.428364 0.618399
N  2.23661 -1.614296 -0.034615
N  2.311608 -2.464292 -1.061433
N  2.324345 -3.574055 0.88133
C  3.820067 1.877393 -0.462646
C  3.630089 0.393682 -0.064972
C  2.2271 -0.177679 -0.264839
C  5.330357 2.143128 -0.478237
C  3.275343 2.114206 -1.871917
C  3.168822 2.856409 0.514377
C  -0.000209 0.32862 0.405086
C  2.250651 -2.286558 1.120388
C  -0.800977 1.071001 1.268406
C  -0.591609 -0.441223 -0.589511
C  2.363662 -3.626835 -0.464726
C  -2.793486 0.290853 0.133449
C  -2.175292 1.050478 1.129837
C  -1.974588 -0.449907 -0.713437
C  -4.261879 0.276968 -0.017249
C  -4.939313 -0.900283 -0.340786
C  -5.007922 1.444284 0.156205
C  -6.318425 -0.909225 -0.487829
C  -6.387101 1.435064 0.01064
C  -7.048825 0.258303 -0.312622
H  4.25211 -0.191109 -0.758554
H  1.929194 -0.048037 -1.308954
H  5.781915 2.029994 0.509469
H  5.85197 1.470892 -1.164141
H  5.53506 3.164691 -0.803863
H  3.563672 3.105612 -2.226368
H  2.185166 2.072197 -1.914846
H  3.666571 1.389819 -2.590986
H  2.08104 2.827963 0.482608
H  3.46875 3.876656 0.265184
H  3.48059 2.671485 1.542624
H  4.938487 -0.063566 1.298036
H  2.192848 -1.817382 2.088629
H  -0.341842 1.660736 2.051865
H  -0.015061 -1.040686 -1.280884
H  2.42617 -4.549466 -1.020619
H  -2.775068 1.624713 1.824806
H  -2.411729 -1.040741 -1.508499
H  -4.388267 -1.825254 -0.45958
H  -4.506468 2.376437 0.386075
H  -6.824277 -1.8344 -0.732655
H  -6.94486 2.353378 0.142356
H  -8.12507 0.25117 -0.426917
elementType: O N C H
totalener: -1090.78632002 hartree
nucrepener: 2139.57104946 hartree
electener: -3230.35736949 hartree
oneelecener: -5732.07605212 hartree
twoeener: 2501.71868263 hartree
cpcmener: -0.02974738 hartree
kineticenergy: 1086.01481068 hartree
xcener: -106.812118555707 hartree
chargesum: 0.0000000
charge: -0.400033 -0.303682 0.103970 -0.356651 -0.408152 0.215276 0.115611 0.104734 -0.340198 -0.362124 -0.335465 0.306618 0.071297 -0.251093 -0.191406 0.072705 0.112750 -0.152156 -0.220141 0.101223 -0.207512 -0.212228 -0.171548 -0.170220 -0.150265 0.107634 0.160711 0.094506 0.102050 0.094378 0.100695 0.093952 0.106999 0.091494 0.097910 0.094866 0.221646 0.170830 0.143037 0.130656 0.163501 0.145946 0.146710 0.144403 0.144803 0.157301 0.156304 0.158361
qa: -0.4000 -0.3037 0.1040 -0.3567 -0.4082 0.2153 0.1156 0.1047 -0.3402 -0.3621 -0.3355 0.3066 0.0713 -0.2511 -0.1914 0.0727 0.1127 -0.1522 -0.2201 0.1012 -0.2075 -0.2122 -0.1715 -0.1702 -0.1503 0.1076 0.1607 0.0945 0.1020 0.0944 0.1007 0.0940 0.1070 0.0915 0.0979 0.0949 0.2216 0.1708 0.1430 0.1307 0.1635 0.1459 0.1467 0.1444 0.1448 0.1573 0.1563 0.1584
va: 2.0429 2.0861 3.3361 2.8766 3.0523 3.7320 3.9204 3.9059 3.9184 3.9437 3.9263 3.7214 4.0897 4.0314 3.9419 4.0317 3.5703 3.9445 4.0188 3.5207 3.9436 3.9465 3.9198 3.9210 3.8898 1.0008 0.9840 1.0135 1.0026 1.0070 1.0054 1.0010 1.0038 1.0063 1.0045 1.0237 1.0116 1.0108 1.0096 1.0311 0.9931 1.0012 1.0028 1.0053 1.0055 0.9931 0.9934 0.9902
dispcorr: -0.024143569 hartree
energy: -1090.810463591392
dipole: 14.09012 -13.38135 0.70877 17.19022 -15.84339 1.34683 -5.58569 4.92972 -0.65596
magnitude: 1.65728 au
magnitude: 4.21248 debye
