program: Gaussian 09
title: 000030173
version: EM64L-G09RevD.01
frameworkgroup: C1[X(C16H39NO2Si2)]
method: RPBEPBE
basis: SDD
operation: Freq
keyword: #p
keyword: freq=noraman
keyword: PBEPBE/SDD
title: #p freq=noraman PBEPBE/SDD
converged: YES YES NO NO
title: Mulliken charges:
elementType: Si Si O O N C C C C C C C C C C C C C C C C H H H H H H H H H H H H H H H H H H H H H H H H H H H H H H H H H H H H H H H
charge: 1.424487 1.426920 -0.596170 -0.596465 -0.307201 -0.772507 -0.769760 -0.788082 -0.773723 -0.770938 -0.788225 -0.258302 -0.259881 -0.668795 -0.667479 -0.682710 -0.667897 -0.668423 -0.682733 -0.369903 -0.369321 0.228455 0.227295 0.226597 0.227855 0.241635 0.243184 0.227725 0.228507 0.227913 0.226365 0.242477 0.242809 0.204602 0.175225 0.205901 0.173989 0.217045 0.229419 0.216985 0.232652 0.215593 0.216934 0.216399 0.217688 0.226520 0.215975 0.232542 0.217289 0.230435 0.216940 0.216562 0.216885 0.216648 0.226407 0.202144 0.218185 0.219276 0.200741 0.237312
chargesum: 0.00000
title: Mulliken charges with hydrogens summed into heavy atoms:
elementType: Si Si O O N C C C C C C C C C C C C C C C C
charge: 1.424487 1.426920 -0.596170 -0.596465 -0.069889 -0.316757 -0.315308 -0.303264 -0.317492 -0.316660 -0.302939 0.121526 0.120009 -0.005346 -0.002299 -0.022104 -0.002092 -0.004486 -0.022793 0.050426 0.050696
polarizability: 2.80473406e+02 -2.74288569e-01 2.30100834e+02 -2.53125616e-01 1.62890480e+00 2.00392399e+02
1716.lowfreq: -0.0009 -0.0007 0.0008 5.4210 6.5207 7.4268 9.8472 14.6281 20.5931
frequency: 9.4163 14.1759 20.3296 25.7720 34.5880 40.9316 47.1643 50.8498 52.0166 53.7248 58.9316 75.3887 80.5732 84.5431 98.4149 104.2234 109.6131 118.5085 119.9520 133.7349 157.3036 158.6806 161.9733 168.5198 182.2409 185.5672 193.5101 220.7615 224.2286 224.7979 235.8444 241.6282 242.4001 269.1226 287.0297 290.4951 302.2178 349.2348 355.8829 381.7527 382.9255 441.9018 446.5099 563.0333 571.0796 640.1767 640.2248 663.7518 683.9700 685.8932 687.3912 697.8765 738.3228 741.7306 743.6968 743.8933 762.7694 765.2177 808.6012 822.7878 948.0377 948.9505 971.2354 972.1767 979.9123 980.6366 987.1494 987.8602 990.3474 990.9248 999.1327 999.6201 1010.0182 1011.4523 1018.9757 1019.2726 1023.4819 1028.4098 1038.4718 1039.1918 1041.9776 1048.8127 1080.7428 1104.3496 1141.1612 1149.0685 1167.9169 1226.5325 1228.1755 1229.5982 1229.6848 1229.7813 1238.4449 1238.5397 1244.0731 1246.7885 1250.3220 1250.7416 1257.5199 1258.5959 1268.1664 1274.1699 1293.1644 1334.2042 1375.1005 1392.2260 1392.7246 1393.7731 1393.8039 1395.7389 1395.9126 1397.2775 1433.2392 1434.8894 1440.2363 1442.6057 1445.2229 1445.5794 1452.3368 1475.6742 1479.1143 1482.5245 1482.7256 1482.9373 1483.4629 1483.8898 1483.9331 1485.4631 1485.8977 1486.3984 1487.5642 1489.6659 1489.8554 1490.6302 1496.1578 2899.3546 2905.5510 2908.2565 2911.8370 2966.6636 2967.0452 2968.5675 2969.7974 2970.1317 2971.2628 2973.5728 2973.6809 2974.6737 2974.9792 2981.6011 2982.6894 2992.1126 2992.1520 3016.7539 3017.4180 3020.4702 3021.4936 3038.6906 3039.3147 3039.9461 3041.0382 3061.9747 3062.6775 3062.8783 3063.3498 3063.4945 3063.7508 3066.9078 3067.8700 3071.2279 3071.9892 3072.6129 3073.2454 3419.4894
redmass: 3.2462 3.6181 3.5252 3.7144 2.8341 2.7152 2.6302 3.0826 2.6697 2.8270 1.9576 2.0560 2.6090 2.2584 2.0847 2.9991 2.4033 3.0766 2.4480 1.9160 1.9479 1.6211 2.0805 2.0143 2.1508 1.9794 1.9331 1.6251 1.2905 1.3017 1.6945 1.4682 1.5287 3.8378 3.4879 3.4556 3.3483 3.4462 3.1293 3.1643 3.1254 4.7170 3.2379 3.5722 3.4869 2.2823 2.2866 2.4377 2.0693 1.6065 1.5676 1.3598 4.2926 3.5868 1.4608 1.4397 1.8588 2.1140 1.1053 1.1359 1.1318 1.1379 1.1590 1.1593 1.2974 1.2897 1.3797 1.3781 1.4840 1.5160 1.5686 1.5652 3.3540 5.0075 2.9610 2.9317 2.8161 2.8031 2.4267 2.3966 4.6806 1.9228 2.5653 2.9990 1.5739 3.7283 1.1455 1.3223 1.2838 1.2706 1.2822 1.2777 1.2633 1.2594 1.4065 1.4046 1.4345 1.4417 1.3881 1.3749 1.1240 1.1037 1.2081 1.2619 1.3429 1.1858 1.1838 1.1837 1.1863 1.1870 1.1857 1.4343 1.0768 1.0761 1.0800 1.0780 1.0787 1.0771 1.2275 1.0700 1.0695 1.0473 1.0418 1.0470 1.0425 1.0463 1.0473 1.0438 1.0483 1.0499 1.0529 1.0411 1.0413 1.0841 1.0827 1.0704 1.0704 1.0614 1.0609 1.0568 1.0562 1.0419 1.0474 1.0481 1.0418 1.0378 1.0372 1.0396 1.0406 1.0964 1.0964 1.0596 1.0596 1.0990 1.0990 1.0985 1.0986 1.0940 1.0992 1.0992 1.0920 1.0994 1.1001 1.1001 1.0995 1.0999 1.0999 1.1000 1.0999 1.0997 1.0998 1.0997 1.0997 1.0735
irintensity: 0.0087 0.1052 0.0544 0.0756 0.0621 0.0691 0.0245 0.2240 0.1201 0.1972 1.0089 0.1158 0.1726 1.7167 0.8692 0.3675 0.5365 1.1123 2.5388 0.3283 2.0524 0.3080 1.4493 0.6608 0.1930 16.8190 4.0156 0.8947 0.2182 0.7483 5.5418 4.3761 1.3400 0.1676 0.6237 0.1062 7.9859 1.7918 1.1844 10.1926 22.9681 5.2063 11.4693 0.1091 1.6142 4.3979 11.7446 23.5875 1.9350 21.9800 14.4346 107.5137 127.8347 8.3948 55.8709 47.3866 23.3867 275.1138 1.1827 0.4907 1.8239 2.7614 9.0806 7.4605 0.4920 0.5893 9.7867 11.4069 21.1742 6.0649 2.0806 2.6992 22.1545 392.9812 25.4007 85.7964 13.2251 12.1388 1.9185 3.0040 10.3370 201.9597 83.6052 0.0378 2.3760 106.9225 10.6894 3.8567 0.6300 0.4828 0.3353 0.2146 5.3605 1.9069 11.9478 13.0168 4.0310 3.2241 14.6689 11.6537 0.5988 3.4949 6.0796 0.2107 8.0057 10.1466 9.2449 6.2399 17.5867 5.5547 5.6618 0.2150 3.1541 3.5566 25.1117 20.8633 29.7771 30.3224 35.0983 0.6008 5.2540 7.8044 2.5915 11.6122 3.4247 8.0952 8.2598 7.7976 20.9770 0.8992 4.3320 9.4718 12.2469 3.7962 4.1635 49.0463 110.5353 45.0870 69.6447 14.6036 19.7874 30.7221 26.5966 57.8884 54.9851 34.6177 86.6340 1.6517 6.8603 2.2724 95.1235 11.6616 16.3512 0.3242 1.6765 29.9064 25.0734 0.3797 0.0393 0.1078 78.0791 48.8808 46.2800 73.3715 30.1878 59.9561 72.7318 21.9992 27.9093 51.9570 20.9718 85.5670 46.5353 2.3420
temp: 298.150 k
press: 1.00000 atm
elementType: 14 14 8 8 7 6 6 6 6 6 6 6 6 6 6 6 6 6 6 6 6 1 1 1 1 1 1 1 1 1 1 1 1 1 1 1 1 1 1 1 1 1 1 1 1 1 1 1 1 1 1 1 1 1 1 1 1 1 1 1
symmnumber: 1
zpe: 1382360.7 jmol-1
zpe.correction: 0.526513 hartree
zpe.thermalcorrener: 0.559666 hartree
zpe.thermalcorrenthalpy: 0.560611 hartree
zpe.thermalcorrgfe: 0.455102 hartree
zpe.sumelectzpe: -1415.347658 hartree
zpe.sumelectthermal: -1415.314505 hartree
zpe.sumelectthermalent: -1415.313561 hartree
zpe.sumelectthermalfe: -1415.419070 hartree
dipole: -0.0171 -0.5609 -2.0150
dipole: 2.0917
quadrupole: -133.3432 -147.4929 -151.9581
quadrupole: 0.2609 0.0380 1.4887
quadrupole: 10.9215 -3.2282 -7.6934 0.2609 0.0380 1.4887
hfenergy: -1415.8741713 hartree
pointgroup: C01 [X(C16H39N1O2Si2)]
dipole: -0.0050699 0.1861931 0.8015684 debye
polarizability: 280.4751601|0.1050829|229.9033297|0.1676058|2.9054874|200.5881481 unknown
InChI: InChI=1S/C16H39NO2Si2/c1-7-20(8-2,9-3)18-15-13-17-14-16-19-21(10-4,11-5)12-6/h17H,7-16H2,1-6H3
charge 0 multiplicity 1
60 atoms
Si 5.26498 -0.05074 0.142279
Si -5.263635 -0.000558 0.171559
O  3.669163 0.229708 -0.542068
O  -3.656813 0.201693 -0.513204
N  0.006897 0.577674 0.085869
C  5.681093 1.373001 1.363996
C  5.27066 -1.735153 1.065357
C  6.409273 -0.061567 -1.384981
C  -5.271722 -1.533625 1.328539
C  -5.73946 1.577658 1.157298
C  -6.360541 -0.250107 -1.370864
C  2.460075 0.357298 0.26713
C  -2.447371 0.369833 0.286978
C  5.65715 2.779542 0.71188
C  4.881834 -2.937692 0.167224
C  7.898009 -0.327043 -1.040216
C  -4.858911 -2.848043 0.616949
C  -5.729573 2.871282 0.302507
C  -7.861812 -0.456169 -1.040553
C  1.254311 0.373879 -0.683828
C  -1.24713 0.368819 -0.671232
H  6.674298 1.17892 1.818676
H  4.955074 1.33494 2.202504
H  4.575707 -1.669637 1.927731
H  6.277462 -1.894792 1.503555
H  6.304152 0.909164 -1.907332
H  6.036652 -0.827637 -2.092377
H  -4.590749 -1.338963 2.182728
H  -6.283712 -1.639998 1.771129
H  -6.74138 1.426345 1.609551
H  -5.038892 1.685946 2.011072
H  -6.230294 0.626477 -2.034855
H  -5.969144 -1.118363 -1.935797
H  2.350309 -0.486586 0.980907
H  2.490422 1.301076 0.859585
H  -2.326673 -0.451594 1.024551
H  -2.484406 1.330871 0.851076
H  6.434797 2.876032 -0.068784
H  4.682455 2.977739 0.228487
H  5.834335 3.576564 1.458156
H  3.882544 -2.791261 -0.282519
H  5.59966 -3.06966 -0.664042
H  4.859735 -3.882558 0.741793
H  8.301504 0.443306 -0.355711
H  8.033433 -1.310312 -0.551078
H  8.527144 -0.321939 -1.949432
H  -5.573987 -3.114873 -0.183732
H  -3.862663 -2.74987 0.147605
H  -4.818318 -3.69721 1.324449
H  -4.743557 3.026016 -0.173293
H  -6.48069 2.824221 -0.507948
H  -5.9553 3.764439 0.914741
H  -8.020761 -1.348853 -0.406015
H  -8.284866 0.413712 -0.502767
H  -8.459002 -0.596178 -1.960558
H  1.435561 1.142813 -1.471906
H  1.195143 -0.604043 -1.196145
H  -1.196802 -0.616926 -1.169289
H  -1.430332 1.127011 -1.469361
H  0.007964 1.492469 0.560125
