program: Orca
programVersion: 4.2.1
elementType: O O N N N C C C C C C C C C C C C C C C C C C C C H H H H H H H H H H H H H H H H H H H H H H H
charge: 0
multiplicity: 1
keywords: wb97x-d3
keywords: def2-TZVPP
keywords: def2/J RIJCOSX GRIDX6 NOFINALGRIDX
keywords: grid4 nofinalgrid
keywords: scfconv7
keywords: smallprint printgap noloewdin
keywords: NOSOSCF
formula: C20H23N3O2
InChI: InChI=1S/C20H23N3O2/c1-20(2,3)18(24)19(23-14-21-13-22-23)25-17-11-9-16(10-12-17)15-7-5-4-6-8-15/h4-14,18-19,24H,1-3H3
48 atoms
O  3.372625 2.360167 0.645988
O  1.174536 0.976186 0.968773
N  1.945197 -0.938885 -0.101749
N  2.353021 -1.742526 0.885239
N  1.37896 -2.935767 -0.746084
C  4.573085 0.793152 -0.672169
C  3.46138 0.984791 0.384533
C  2.058559 0.491521 -0.016164
C  4.249582 1.533958 -1.972091
C  5.867002 1.367239 -0.079525
C  4.824554 -0.685631 -0.981076
C  -0.155637 0.756724 0.731457
C  1.351207 -1.66907 -1.060264
C  -0.818458 -0.218998 1.458981
C  -0.839954 1.507683 -0.213935
C  1.999896 -2.927539 0.453608
C  -2.877183 0.304695 0.296874
C  -2.169356 -0.433858 1.243556
C  -2.189012 1.277668 -0.426582
C  -4.31545 0.066253 0.070965
C  -4.836189 0.009057 -1.220945
C  -5.185492 -0.108912 1.146127
C  -6.18695 -0.216916 -1.43206
C  -6.53631 -0.334881 0.936142
C  -7.042434 -0.38985 -0.354101
H  3.754709 0.423514 1.28474
H  1.783405 0.880721 -1.003759
H  3.387927 1.107527 -2.491003
H  4.05383 2.591897 -1.801767
H  5.092432 1.460078 -2.661364
H  5.789539 2.432242 0.129309
H  6.692748 1.22094 -0.778103
H  6.133588 0.859695 0.85027
H  5.738954 -0.78084 -1.569178
H  4.029162 -1.144167 -1.567738
H  4.955276 -1.276873 -0.07401
H  2.725024 2.498462 1.342222
H  0.924989 -1.235304 -1.952084
H  -0.271881 -0.809951 2.182272
H  -0.328166 2.288909 -0.762893
H  2.196111 -3.821605 1.024355
H  -2.674206 -1.213001 1.800359
H  -2.722277 1.887554 -1.1449
H  -4.172891 0.115889 -2.070342
H  -4.804988 -0.042745 2.157842
H  -6.570616 -0.267276 -2.442603
H  -7.196858 -0.460357 1.783987
H  -8.097027 -0.566643 -0.518597
totalener: -1090.75591724 hartree
nucrepener: 2154.56144099 hartree
electener: -3245.31735823 hartree
oneelecener: -5761.36436991 hartree
twoeener: 2516.04701168 hartree
kineticenergy: 1086.02949637 hartree
xcener: -106.808702476932 hartree
chargesum: -0.0000000
charge: -0.345303 -0.342926 0.146054 -0.333210 -0.303763 0.213862 0.106575 0.035496 -0.353441 -0.308405 -0.344954 0.185010 0.032814 -0.145659 -0.165415 0.080549 0.149960 -0.165411 -0.192684 0.136510 -0.197538 -0.195523 -0.133257 -0.133026 -0.118830 0.118239 0.120942 0.072294 0.114491 0.093099 0.107882 0.083018 0.087457 0.093916 0.092144 0.105221 0.184279 0.138313 0.129564 0.131301 0.133796 0.129365 0.128924 0.123832 0.126098 0.125710 0.125796 0.126835
qa: -0.3453 -0.3429 0.1461 -0.3332 -0.3038 0.2139 0.1066 0.0355 -0.3534 -0.3084 -0.3450 0.1850 0.0328 -0.1457 -0.1654 0.0805 0.1500 -0.1654 -0.1927 0.1365 -0.1975 -0.1955 -0.1333 -0.1330 -0.1188 0.1182 0.1209 0.0723 0.1145 0.0931 0.1079 0.0830 0.0875 0.0939 0.0921 0.1052 0.1843 0.1383 0.1296 0.1313 0.1338 0.1294 0.1289 0.1238 0.1261 0.1257 0.1258 0.1268
va: 2.0908 2.0114 3.2569 2.8435 3.0703 3.7527 3.9293 4.0399 3.9390 3.9104 3.9782 3.9010 4.0774 3.9885 3.9804 4.0125 3.5738 3.9928 3.9985 3.5523 3.9984 3.9975 3.9773 3.9744 3.9600 1.0140 0.9866 1.0039 1.0183 1.0084 1.0183 1.0073 1.0073 1.0119 0.9982 1.0133 1.0600 1.0077 1.0193 1.0101 1.0006 1.0071 1.0083 1.0097 1.0097 1.0021 1.0022 0.9997
dispcorr: -0.025114997 hartree
energy: -1090.781032235280
dipole: 19.54435 -20.08778 -0.54343 5.38931 -4.94908 0.44024 -7.58727 7.30225 -0.28502
magnitude: 0.75523 au
magnitude: 1.91964 debye
