program: Orca
programVersion: 4.2.1
elementType: O O N N N C C C C C C C C C C C C C C C C C C C C H H H H H H H H H H H H H H H H H H H H H H H
charge: 0
multiplicity: 1
keywords: wb97x-d3
keywords: def2-TZVPP
keywords: def2/J RIJCOSX GRIDX6 NOFINALGRIDX
keywords: grid4 nofinalgrid
keywords: scfconv7
keywords: smallprint printgap noloewdin
keywords: NOSOSCF
formula: C20H23N3O2
InChI: InChI=1S/C20H23N3O2/c1-20(2,3)18(24)19(23-14-21-13-22-23)25-17-11-9-16(10-12-17)15-7-5-4-6-8-15/h4-14,18-19,24H,1-3H3
48 atoms
O  3.355325 2.268337 0.895229
O  1.186696 0.808915 1.109288
N  1.952043 -0.932342 -0.231369
N  2.401945 -1.855563 0.623797
N  1.375428 -2.831795 -1.116175
C  4.541778 0.887459 -0.63035
C  3.45584 0.93527 0.468724
C  2.049336 0.47516 0.045174
C  4.162846 1.750692 -1.836199
C  5.836341 1.433889 -0.013921
C  4.823285 -0.542855 -1.099775
C  -0.148397 0.632427 0.859413
C  1.326795 -1.534806 -1.256667
C  -0.788446 -0.498924 1.341191
C  -0.857206 1.581488 0.136836
C  2.041674 -2.976593 0.05033
C  -2.872319 0.260775 0.368827
C  -2.140207 -0.674778 1.098514
C  -2.207807 1.391755 -0.103836
C  -4.309862 0.059125 0.104548
C  -5.209768 1.120319 0.193978
C  -4.800446 -1.198996 -0.242592
C  -6.559132 0.930078 -0.0571
C  -6.149853 -1.390706 -0.491702
C  -7.034765 -0.326608 -0.400546
H  3.779645 0.276419 1.288651
H  1.739698 0.989971 -0.872481
H  3.309161 1.346637 -2.38414
H  3.929081 2.77446 -1.547783
H  4.994384 1.787293 -2.541938
H  6.647248 1.374199 -0.741929
H  6.137164 0.847825 0.857217
H  5.741164 2.472047 0.29678
H  4.024959 -0.959537 -1.712377
H  4.993085 -1.221721 -0.263874
H  5.723773 -0.549052 -1.716057
H  2.724451 2.309963 1.618765
H  0.863086 -0.990112 -2.065121
H  -0.228552 -1.229481 1.910786
H  -0.355277 2.468101 -0.231311
H  2.266402 -3.936758 0.487704
H  -2.637719 -1.548559 1.499326
H  -2.749175 2.126115 -0.686868
H  -4.854464 2.099913 0.488506
H  -4.115304 -2.031471 -0.343689
H  -7.242649 1.764929 0.024828
H  -6.509492 -2.373391 -0.766685
H  -8.088379 -0.475792 -0.59583
totalener: -1090.75605426 hartree
nucrepener: 2155.87550427 hartree
electener: -3246.63155853 hartree
oneelecener: -5763.97655159 hartree
twoeener: 2517.34499306 hartree
kineticenergy: 1086.03263567 hartree
xcener: -106.809382088538 hartree
chargesum: 0.0000000
charge: -0.344841 -0.345682 0.140494 -0.329700 -0.301666 0.214899 0.104183 0.042296 -0.356137 -0.306330 -0.345772 0.195858 0.025207 -0.149257 -0.171723 0.079034 0.146660 -0.166199 -0.186056 0.127528 -0.189647 -0.195113 -0.135107 -0.134010 -0.116687 0.116814 0.124657 0.072654 0.114421 0.093836 0.082364 0.086859 0.107811 0.092612 0.105899 0.093590 0.183897 0.139970 0.130218 0.133476 0.134219 0.126298 0.128162 0.123538 0.128047 0.124961 0.126260 0.127203
qa: -0.3448 -0.3457 0.1405 -0.3297 -0.3017 0.2149 0.1042 0.0423 -0.3561 -0.3063 -0.3458 0.1959 0.0252 -0.1493 -0.1717 0.0790 0.1467 -0.1662 -0.1861 0.1275 -0.1896 -0.1951 -0.1351 -0.1340 -0.1167 0.1168 0.1247 0.0727 0.1144 0.0938 0.0824 0.0869 0.1078 0.0926 0.1059 0.0936 0.1839 0.1400 0.1302 0.1335 0.1342 0.1263 0.1282 0.1235 0.1280 0.1250 0.1263 0.1272
va: 2.0907 2.0074 3.2585 2.8389 3.0676 3.7499 3.9283 4.0302 3.9387 3.9118 3.9785 3.8814 4.0826 3.9905 3.9920 4.0088 3.5914 3.9923 3.9864 3.5670 3.9936 3.9977 3.9743 3.9743 3.9566 1.0140 0.9853 1.0038 1.0182 1.0087 1.0072 1.0076 1.0178 0.9978 1.0129 1.0120 1.0602 1.0075 1.0179 1.0109 1.0007 1.0084 1.0088 1.0104 1.0089 1.0025 1.0023 0.9993
dispcorr: -0.025169546 hartree
energy: -1090.781223810384
dipole: 19.27403 -19.83360 -0.55957 6.51899 -6.03865 0.48034 -7.23859 7.00422 -0.23437
magnitude: 0.77381 au
magnitude: 1.96686 debye
