program: Orca
programVersion: 4.2.1
elementType: O O N N N C C C C C C C C C C C C C C C C C C C C H H H H H H H H H H H H H H H H H H H H H H H
charge: 0
multiplicity: 1
keywords: wb97x-d3
keywords: def2-TZVPP
keywords: def2/J RIJCOSX GRIDX6 NOFINALGRIDX
keywords: grid4 nofinalgrid
keywords: scfconv7
keywords: smallprint printgap noloewdin
keywords: NOSOSCF
formula: C20H23N3O2
InChI: InChI=1S/C20H23N3O2/c1-20(2,3)18(24)19(23-14-21-13-22-23)25-17-11-9-16(10-12-17)15-7-5-4-6-8-15/h4-14,18-19,24H,1-3H3
48 atoms
O  3.936986 0.464368 1.431818
O  1.313009 0.465154 0.60108
N  2.246839 -1.615439 0.113866
N  2.744148 -2.078365 1.267392
N  1.972855 -3.771457 0.026024
C  3.875266 1.80425 -0.545248
C  3.643111 0.406415 0.073491
C  2.247809 -0.193467 -0.185816
C  5.368862 2.117732 -0.391342
C  3.540753 1.782903 -2.038786
C  3.068415 2.908304 0.141912
C  -0.017097 0.348277 0.358915
C  1.788539 -2.646267 -0.611947
C  -0.580179 -0.147482 -0.809855
C  -0.851237 0.810131 1.372788
C  2.560375 -3.371297 1.171436
C  -2.808074 0.289128 0.046017
C  -1.960252 -0.172964 -0.953232
C  -2.221687 0.782984 1.21261
C  -4.272433 0.265933 -0.125327
C  -5.053235 1.353855 0.263592
C  -4.909627 -0.84037 -0.686122
C  -6.42848 1.337358 0.095161
C  -6.28459 -0.857032 -0.857138
C  -7.049891 0.232144 -0.467302
H  4.329301 -0.274867 -0.462792
H  2.025941 -0.120671 -1.255327
H  5.597791 3.087373 -0.836758
H  5.667448 2.151868 0.654902
H  5.988999 1.371413 -0.893566
H  3.879444 2.705462 -2.511771
H  2.467399 1.714746 -2.228853
H  4.033018 0.956542 -2.55855
H  1.998277 2.823313 -0.040252
H  3.384094 3.880659 -0.241575
H  3.226884 2.908873 1.218888
H  3.774697 -0.407534 1.817752
H  1.33906 -2.531803 -1.586086
H  0.023365 -0.493867 -1.637269
H  -0.409409 1.18577 2.286244
H  2.860484 -4.049839 1.954117
H  -2.378848 -0.538363 -1.88248
H  -2.85118 1.129855 2.022369
H  -4.576019 2.233272 0.678204
H  -4.325249 -1.707708 -0.967512
H  -7.015553 2.195392 0.395546
H  -6.760611 -1.728401 -1.287535
H  -8.123468 0.219602 -0.600607
totalener: -1090.75671697 hartree
nucrepener: 2138.84185249 hartree
electener: -3229.59856947 hartree
oneelecener: -5729.69606473 hartree
twoeener: 2500.09749526 hartree
kineticenergy: 1086.02800465 hartree
xcener: -106.814029959635 hartree
chargesum: 0.0000000
charge: -0.358957 -0.256874 0.129969 -0.348171 -0.329918 0.211266 0.109557 0.007733 -0.309873 -0.359870 -0.308420 0.308907 0.071827 -0.196621 -0.206491 0.083564 0.123610 -0.204282 -0.131892 0.118993 -0.197207 -0.192660 -0.135953 -0.136751 -0.117339 0.095013 0.124632 0.082589 0.112202 0.080619 0.097688 0.085330 0.097209 0.081186 0.086578 0.107976 0.199655 0.134576 0.096022 0.127633 0.138425 0.123642 0.128073 0.124884 0.125900 0.125106 0.124612 0.126307
qa: -0.3590 -0.2569 0.1300 -0.3482 -0.3299 0.2113 0.1096 0.0077 -0.3099 -0.3599 -0.3084 0.3089 0.0718 -0.1966 -0.2065 0.0836 0.1236 -0.2043 -0.1319 0.1190 -0.1972 -0.1927 -0.1360 -0.1368 -0.1173 0.0950 0.1246 0.0826 0.1122 0.0806 0.0977 0.0853 0.0972 0.0812 0.0866 0.1080 0.1997 0.1346 0.0960 0.1276 0.1384 0.1236 0.1281 0.1249 0.1259 0.1251 0.1246 0.1263
va: 2.0935 2.1256 3.2939 2.9002 3.0756 3.7352 3.9614 4.0470 3.9213 3.9371 3.9505 3.7778 4.0768 3.9763 4.0525 4.0331 3.6369 4.0752 3.9487 3.5677 3.9954 3.9879 3.9781 3.9754 3.9546 1.0025 0.9824 1.0081 1.0176 1.0068 1.0106 1.0019 1.0064 1.0110 1.0056 1.0219 1.0800 1.0028 1.0247 1.0161 0.9987 1.0107 1.0059 1.0098 1.0092 1.0025 1.0028 0.9996
dispcorr: -0.023885945 hartree
energy: -1090.780602919269
dipole: 13.42856 -13.80925 -0.38069 15.53876 -15.25070 0.28806 -8.00592 7.12933 -0.87659
magnitude: 0.99816 au
magnitude: 2.53712 debye
