program: Orca
programVersion: 4.2.1
elementType: O O N N N C C C C C C C C C C C C C C C C C C C C H H H H H H H H H H H H H H H H H H H H H H H
charge: 0
multiplicity: 1
keywords: wb97x-d3
keywords: def2-TZVPP
keywords: def2/J RIJCOSX GRIDX6 NOFINALGRIDX
keywords: grid4 nofinalgrid
keywords: scfconv7
keywords: smallprint printgap noloewdin
keywords: NOSOSCF
formula: C20H23N3O2
InChI: InChI=1S/C20H23N3O2/c1-20(2,3)18(24)19(23-14-21-13-22-23)25-17-11-9-16(10-12-17)15-7-5-4-6-8-15/h4-14,18-19,24H,1-3H3
48 atoms
O  3.989125 0.367917 1.362192
O  1.355107 0.548201 0.551592
N  2.156697 -1.576355 0.026474
N  2.659908 -2.100089 1.151262
N  1.673056 -3.694744 -0.06807
C  3.990558 1.746955 -0.589278
C  3.679207 0.354389 0.006143
C  2.248187 -0.154042 -0.250132
C  3.642918 1.773468 -2.079464
C  3.258121 2.884798 0.125342
C  5.501648 1.966995 -0.443779
C  0.016039 0.426175 0.351667
C  1.565471 -2.548068 -0.685047
C  -0.576272 0.145179 -0.873202
C  -0.789115 0.653075 1.462147
C  2.34928 -3.368252 1.051616
C  -2.779479 0.319739 0.124705
C  -1.958335 0.09198 -0.974262
C  -2.164485 0.605817 1.34407
C  -4.247875 0.266135 0.001633
C  -4.866493 -0.747342 -0.729417
C  -5.050837 1.230469 0.609606
C  -6.245889 -0.79376 -0.852254
C  -6.430465 1.183879 0.489019
C  -7.033661 0.172018 -0.243513
H  4.316781 -0.357337 -0.549938
H  2.025997 -0.053816 -1.316639
H  4.085608 0.932296 -2.619537
H  2.56578 1.766908 -2.260234
H  4.026703 2.685838 -2.537678
H  2.182392 2.861164 -0.040607
H  3.622897 3.843292 -0.249409
H  3.432263 2.860331 1.199653
H  5.809093 1.968982 0.600402
H  5.785761 2.926958 -0.878331
H  6.071923 1.1914 -0.960628
H  3.790191 -0.504979 1.728431
H  1.07902 -2.375424 -1.632467
H  0.009872 -0.003254 -1.770725
H  -0.323002 0.861076 2.416165
H  2.621782 -4.08381 1.811098
H  -2.402733 -0.101512 -1.942461
H  -2.773011 0.765356 2.225349
H  -4.262555 -1.522595 -1.184594
H  -4.589138 2.040417 1.160881
H  -6.707211 -1.593082 -1.417408
H  -7.035789 1.946583 0.961236
H  -8.110768 0.136021 -0.338676
totalener: -1090.75668975 hartree
nucrepener: 2142.37127918 hartree
electener: -3233.12796893 hartree
oneelecener: -5736.81473803 hartree
twoeener: 2503.68676910 hartree
kineticenergy: 1086.02952792 hartree
xcener: -106.813631177786 hartree
chargesum: -0.0000000
charge: -0.359478 -0.265893 0.132223 -0.348234 -0.328207 0.212692 0.113744 0.000409 -0.360486 -0.310924 -0.309986 0.281558 0.074866 -0.202438 -0.195554 0.082830 0.132332 -0.190057 -0.138574 0.123688 -0.194750 -0.198305 -0.135847 -0.135543 -0.117445 0.094320 0.118104 0.097900 0.083991 0.097829 0.082551 0.086980 0.108061 0.112106 0.082788 0.080096 0.200143 0.134187 0.109756 0.129498 0.137935 0.126068 0.128025 0.125391 0.124779 0.125265 0.125398 0.126210
qa: -0.3595 -0.2659 0.1322 -0.3482 -0.3282 0.2127 0.1137 0.0004 -0.3605 -0.3109 -0.3100 0.2816 0.0749 -0.2024 -0.1956 0.0828 0.1323 -0.1901 -0.1386 0.1237 -0.1948 -0.1983 -0.1358 -0.1355 -0.1174 0.0943 0.1181 0.0979 0.0840 0.0978 0.0826 0.0870 0.1081 0.1121 0.0828 0.0801 0.2001 0.1342 0.1098 0.1295 0.1379 0.1261 0.1280 0.1254 0.1248 0.1253 0.1254 0.1262
va: 2.0921 2.1046 3.2849 2.9009 3.0763 3.7323 3.9592 4.0613 3.9383 3.9489 3.9211 3.7935 4.0757 3.9637 4.0524 4.0349 3.6202 4.0475 3.9566 3.5625 3.9900 3.9972 3.9745 3.9770 3.9572 1.0026 0.9874 1.0064 1.0014 1.0108 1.0129 1.0052 1.0215 1.0176 1.0081 1.0071 1.0796 1.0044 1.0160 1.0153 0.9986 1.0097 1.0059 1.0095 1.0099 1.0024 1.0023 0.9997
dispcorr: -0.024009288 hartree
energy: -1090.780699038653
dipole: 14.33954 -14.75781 -0.41827 15.01459 -14.72805 0.28654 -7.90139 7.04658 -0.85481
magnitude: 0.99386 au
magnitude: 2.52619 debye
