program: Orca
programVersion: 4.2.1
elementType: O O N N N C C C C C C C C C C C C C C C C C C C C H H H H H H H H H H H H H H H H H H H H H H H
charge: 0
multiplicity: 1
keywords: wb97x-d3
keywords: def2-TZVPP
keywords: def2/J RIJCOSX GRIDX6 NOFINALGRIDX
keywords: grid4 nofinalgrid
keywords: scfconv7
keywords: smallprint printgap noloewdin
keywords: NOSOSCF
formula: C20H23N3O2
InChI: InChI=1S/C20H23N3O2/c1-20(2,3)18(24)19(23-14-21-13-22-23)25-17-11-9-16(10-12-17)15-7-5-4-6-8-15/h4-14,18-19,24H,1-3H3
48 atoms
O  3.022222 2.369659 0.562543
O  1.093622 0.581114 0.944048
N  2.197968 -1.146152 -0.147102
N  2.093299 -1.754798 -1.333261
N  2.494992 -3.253785 0.28333
C  4.56603 0.898804 -0.496367
C  3.338811 1.010285 0.437699
C  2.06019 0.285486 -0.027601
C  4.214219 1.288373 -1.933976
C  5.640735 1.855651 0.038041
C  5.164839 -0.511845 -0.480693
C  -0.233494 0.443896 0.661937
C  2.434841 -2.057921 0.808439
C  -1.104076 0.888491 1.651102
C  -0.742272 -0.094511 -0.512309
C  2.282149 -3.015369 -1.027548
C  -3.006807 0.27183 0.289379
C  -2.469182 0.802173 1.462654
C  -2.117325 -0.170563 -0.683385
C  -4.465256 0.177558 0.092157
C  -5.042417 0.491136 -1.137887
C  -5.301515 -0.229843 1.131032
C  -6.412338 0.398614 -1.32423
C  -6.671892 -0.319416 0.946955
C  -7.233223 -0.006247 -0.282097
H  3.629652 0.580838 1.413132
H  1.765814 0.650545 -1.015951
H  5.119988 1.327717 -2.541244
H  3.549658 0.562795 -2.406719
H  3.745711 2.271452 -1.983148
H  6.554816 1.73958 -0.546505
H  5.89022 1.635152 1.078814
H  5.337442 2.898691 -0.019372
H  4.558202 -1.247688 -1.004237
H  5.340882 -0.87002 0.536075
H  6.133361 -0.496744 -0.983365
H  2.285838 2.461034 1.173095
H  2.54361 -1.812676 1.85322
H  -0.703656 1.312288 2.563105
H  -0.102835 -0.486407 -1.291144
H  2.259359 -3.791394 -1.776157
H  -3.129539 1.179048 2.233379
H  -2.499027 -0.618252 -1.592228
H  -4.414904 0.835096 -1.950708
H  -4.872194 -0.505607 2.086221
H  -6.840801 0.652674 -2.284884
H  -7.302245 -0.64504 1.764049
H  -8.30301 -0.077643 -0.426889
totalener: -1090.75847399 hartree
nucrepener: 2134.59246677 hartree
electener: -3225.35094076 hartree
oneelecener: -5721.14509828 hartree
twoeener: 2495.79415752 hartree
kineticenergy: 1086.01198468 hartree
xcener: -106.809026595223 hartree
chargesum: -0.0000000
charge: -0.335598 -0.322377 0.128914 -0.333340 -0.311463 0.220137 0.094368 0.035600 -0.354837 -0.297280 -0.343537 0.299905 0.035100 -0.236846 -0.161462 0.082508 0.124178 -0.135703 -0.213704 0.112499 -0.188530 -0.196911 -0.138852 -0.136312 -0.116752 0.098172 0.150986 0.092065 0.089904 0.110552 0.083480 0.083802 0.106355 0.105687 0.093810 0.095009 0.180087 0.148571 0.115109 0.125596 0.133647 0.125213 0.126892 0.124534 0.123997 0.125691 0.125062 0.126073
qa: -0.3356 -0.3224 0.1289 -0.3333 -0.3115 0.2201 0.0944 0.0356 -0.3548 -0.2973 -0.3435 0.2999 0.0351 -0.2368 -0.1615 0.0825 0.1242 -0.1357 -0.2137 0.1125 -0.1885 -0.1969 -0.1389 -0.1363 -0.1168 0.0982 0.1510 0.0921 0.0899 0.1106 0.0835 0.0838 0.1064 0.1057 0.0938 0.0950 0.1801 0.1486 0.1151 0.1256 0.1336 0.1252 0.1269 0.1245 0.1240 0.1257 0.1251 0.1261
va: 2.1010 2.0493 3.2380 2.7996 3.0718 3.7019 4.0079 3.9770 3.9358 3.9222 3.9528 3.8218 4.0955 4.0852 3.9408 4.0083 3.6358 3.9824 4.0691 3.5749 3.9884 3.9963 3.9788 3.9787 3.9562 1.0008 0.9913 1.0093 1.0136 1.0159 1.0069 1.0072 1.0172 1.0079 1.0082 1.0126 1.0638 1.0051 1.0190 1.0423 1.0001 1.0071 1.0096 1.0098 1.0102 1.0024 1.0026 0.9996
dispcorr: -0.024472007 hartree
energy: -1090.782945992992
dipole: 19.35682 -19.62520 -0.26838 7.25693 -6.75491 0.50202 -4.63085 4.91581 0.28496
magnitude: 0.63660 au
magnitude: 1.61810 debye
