program: Gaussian 09
title: 000030226
version: EM64L-G09RevD.01
frameworkgroup: C1[X(C18H28N2O)]
method: RPBEPBE
basis: SDD
operation: Freq
keyword: #p
keyword: freq=noraman
keyword: PBEPBE/SDD
title: #p freq=noraman PBEPBE/SDD
converged: YES YES NO NO
title: Mulliken charges:
elementType: O N N C C C C C C C C C C C C C C C C C C H H H H H H H H H H H H H H H H H H H H H H H H H H H H
charge: -0.294202 -0.089875 -0.250973 -0.396952 -0.380324 0.059384 -0.327677 -0.330571 0.385167 0.384483 0.147822 -0.706173 -0.675463 -0.418302 -0.426109 -0.810756 -0.842267 -0.235345 -0.304671 -0.108828 -0.749181 0.197342 0.250642 0.262826 0.216761 0.199306 0.181839 0.207364 0.180257 0.273909 0.211544 0.199631 0.210361 0.224503 0.205821 0.235355 0.234294 0.245292 0.224139 0.237326 0.223133 0.260730 0.254814 0.226110 0.259877 0.256775 0.230286 0.228386 0.232185
chargesum: 0.00000
title: Mulliken charges with hydrogens summed into heavy atoms:
elementType: O N N C C C C C C C C C C C C C C C C C C
charge: -0.294202 -0.089875 -0.250973 0.051033 0.099264 0.059384 0.053468 0.057050 0.385167 0.384483 0.147822 -0.021089 -0.034777 -0.182947 -0.191815 -0.103999 -0.103590 -0.009235 -0.044793 0.147947 -0.058325
polarizability: 2.36918826e+02 5.56536180e+00 2.42532444e+02 7.24674450e+00 -2.74837886e+00 1.84578273e+02
1716.lowfreq: -9.4890 -7.9800 -4.9772 -0.0006 -0.0005 -0.0002 17.2432 27.6162 32.7203
frequency: 17.0972 27.3036 32.5804 40.6697 49.6319 57.7301 64.7090 75.6833 90.0840 94.8689 107.6682 117.4884 131.0612 148.4876 171.7447 196.7430 201.6182 216.8898 225.5557 239.3366 251.0443 267.9197 293.4186 302.3066 315.7577 338.5463 364.9629 383.3968 399.7666 415.5551 453.8927 470.3442 486.1927 517.3807 518.6306 549.5024 564.1888 602.5382 670.0443 708.7061 745.5256 754.8351 773.1065 782.9965 794.2374 800.5780 812.5624 843.0459 899.4511 904.1602 916.9218 921.0406 961.0877 979.0135 985.6939 987.6238 990.5707 1022.4770 1035.5022 1042.1224 1048.3111 1049.6522 1054.3814 1069.8203 1075.1706 1081.7163 1089.5765 1099.9122 1115.6494 1124.3535 1163.8548 1178.2407 1212.0510 1226.8175 1237.0548 1256.1918 1265.0743 1277.1490 1285.2962 1288.3371 1306.5661 1310.3384 1326.4491 1350.3925 1359.6399 1361.7587 1366.0013 1378.7806 1385.7228 1393.1209 1396.9266 1400.7168 1404.8688 1434.3187 1438.4231 1452.6804 1458.4809 1463.0565 1463.7346 1464.6031 1465.7876 1466.6164 1472.7323 1477.9507 1482.5887 1485.3077 1487.4559 1492.1005 1502.4130 1547.8337 1593.1572 1600.2548 1668.5639 2837.9624 2847.4066 2957.9585 2965.9218 2976.8686 2977.7271 2980.3332 2983.4952 3015.7756 3023.3623 3027.9432 3032.0945 3038.0646 3057.6200 3059.9654 3073.2685 3076.9459 3079.4236 3083.9655 3090.3754 3091.6635 3091.9344 3099.2483 3106.8867 3120.0258 3129.6573 3131.4087 3155.2117
redmass: 3.3232 3.3209 2.9790 2.9809 2.9884 3.1250 2.6512 1.3281 3.1597 1.0509 2.1701 1.8438 2.3148 2.3064 2.6579 2.1260 1.9977 2.9276 2.8278 1.9527 1.4191 1.9898 1.8872 2.2389 3.4450 2.7476 3.1824 4.4906 3.1761 3.8815 3.0898 2.7215 3.9343 3.3395 3.1432 5.3537 4.6452 3.6648 3.4040 3.2982 3.2000 2.5561 1.7163 1.2156 1.3780 1.4519 1.8370 1.9238 1.3105 2.0338 2.6053 1.9107 3.0034 1.3361 1.6103 2.2966 1.0926 3.0062 1.7499 1.8598 1.5814 2.6694 1.5864 2.0363 2.4757 2.5987 1.6659 1.6794 2.2477 1.8256 1.7679 1.1603 2.3844 2.6507 2.0575 1.6753 2.0299 1.4738 1.2100 1.3501 1.2471 1.6382 1.2792 1.7010 4.0382 1.3547 1.9961 1.3740 1.2433 1.2398 1.2197 1.2336 1.2393 1.2099 2.0433 1.8839 1.0484 1.0668 1.0542 1.0600 1.0764 1.0559 1.0626 1.0803 1.2504 1.2645 1.0630 1.0696 1.0631 7.2245 7.4618 5.6753 5.8672 1.0718 1.0711 1.0589 1.0370 1.0356 1.0395 1.0393 1.0355 1.0911 1.0856 1.0704 1.0875 1.0958 1.0935 1.0936 1.0988 1.0984 1.0973 1.1010 1.1005 1.1000 1.0997 1.1070 1.0929 1.0856 1.0918 1.0905 1.0994
irintensity: 0.1799 0.2092 0.2027 0.0375 2.1114 0.2521 0.4417 0.4037 1.4839 0.4623 0.4458 0.7908 1.5104 0.9840 2.3482 0.8623 0.3889 0.1854 0.0039 2.7918 0.5391 1.1525 1.0432 1.3310 16.4839 3.0622 1.5288 6.1730 7.7735 0.6472 1.8825 6.8342 3.0918 1.9989 0.9861 1.0897 1.9638 21.0956 15.7361 0.3828 1.6556 4.5637 13.4133 38.5551 7.5946 1.8728 5.0408 2.1781 0.2254 30.2571 3.3624 18.9487 3.3328 0.2679 7.2289 2.5591 43.9872 13.1748 5.8754 10.2516 3.4375 6.9608 0.3706 3.3938 20.1676 30.7125 26.7421 33.4585 18.4139 11.2483 66.6542 1.8872 37.2120 73.6905 1.9387 0.4580 2.5616 10.5806 18.9431 38.3490 28.8477 3.2633 22.8163 50.5229 5.1081 1.8127 109.9570 16.2930 18.6857 10.0323 19.9993 19.2770 8.2648 10.8462 23.9213 1.8480 12.0926 14.4470 5.3892 0.4589 45.9822 1.7707 4.7614 3.5523 26.6228 47.4810 14.9810 10.9720 20.5551 217.9695 5.0205 0.6669 91.9938 38.7472 206.5711 43.1765 28.6274 31.7286 28.5358 18.3165 35.8290 3.8254 27.3173 22.4660 45.6430 18.1429 18.4499 14.2457 40.7912 52.1183 12.7818 26.4197 45.9994 12.2959 20.8531 12.1995 10.9256 0.1723 24.1142 14.9095 35.5892
temp: 298.150 k
press: 1.00000 atm
elementType: 8 7 7 6 6 6 6 6 6 6 6 6 6 6 6 6 6 6 6 6 6 1 1 1 1 1 1 1 1 1 1 1 1 1 1 1 1 1 1 1 1 1 1 1 1 1 1 1 1
symmnumber: 1
zpe: 1107168.2 jmol-1
zpe.correction: 0.421698 hartree
zpe.thermalcorrener: 0.446382 hartree
zpe.thermalcorrenthalpy: 0.447326 hartree
zpe.thermalcorrgfe: 0.364816 hartree
zpe.sumelectzpe: -885.802217 hartree
zpe.sumelectthermal: -885.777534 hartree
zpe.sumelectthermalent: -885.776590 hartree
zpe.sumelectthermalfe: -885.859100 hartree
dipole: -2.0323 -2.2703 -1.0286
dipole: 3.2160
quadrupole: -118.1538 -128.4903 -123.7889
quadrupole: -3.1163 -1.3010 -2.8182
quadrupole: 5.3239 -5.0127 -0.3112 -3.1163 -1.3010 -2.8182
hfenergy: -886.2239156 hartree
pointgroup: C01 [X(C18H28N2O1)]
dipole: -0.7756922 -0.9346005 -0.3546074 debye
polarizability: 236.0946111|6.5247557|241.6347126|9.031093|-7.7363453|186.3002191 unknown
InChI: InChI=1S/C18H28N2O/c1-6-10-17(21)20(14-13-19(7-2)8-3)18-15(4)11-9-12-16(18)5/h6,9-12H,7-8,13-14H2,1-5H3
charge 0 multiplicity 1
49 atoms
O  0.055793 2.510728 0.046065
N  3.487767 0.016459 -0.1117
N  -0.325095 0.219625 0.192009
C  2.087446 0.081432 -0.596101
C  1.096384 0.036799 0.597993
C  -1.169131 -0.95267 0.062461
C  4.243439 1.28073 -0.308677
C  4.224463 -1.204977 -0.524791
C  -1.609274 -1.616155 1.247823
C  -1.528287 -1.435023 -1.232396
C  -0.765096 1.533209 -0.026329
C  3.686392 2.452385 0.523485
C  5.388285 -1.564425 0.420695
C  -2.402202 -2.782411 1.116668
C  -2.324251 -2.604542 -1.318175
C  -1.257711 -1.081128 2.624057
C  -1.098078 -0.716257 -2.498132
C  -2.756161 -3.278806 -0.156175
C  -2.219496 1.727326 -0.302053
C  -2.716371 2.970097 -0.551128
C  -4.163418 3.29311 -0.814842
H  1.875317 -0.764006 -1.282094
H  1.905797 1.018202 -1.158719
H  1.369346 0.845264 1.296641
H  1.192842 -0.932213 1.116259
H  5.29222 1.099146 -0.010919
H  4.262499 1.571908 -1.391127
H  3.50265 -2.043359 -0.519588
H  4.610497 -1.123085 -1.57414
H  2.632982 2.674833 0.274999
H  3.743279 2.216043 1.601451
H  4.280591 3.366356 0.334532
H  6.180302 -0.794411 0.416752
H  5.016521 -1.666589 1.455406
H  5.851658 -2.520175 0.111804
H  -2.749873 -3.29501 2.021372
H  -2.602255 -2.986334 -2.307646
H  -1.301467 0.021753 2.651509
H  -1.946721 -1.479713 3.388044
H  -0.23062 -1.365939 2.923879
H  -1.26113 -1.353238 -3.38417
H  -1.672233 0.218653 -2.644377
H  -0.033612 -0.426919 -2.465056
H  -3.369509 -4.182694 -0.242162
H  -2.880507 0.853232 -0.275069
H  -1.996295 3.802377 -0.553468
H  -4.283574 3.781047 -1.802189
H  -4.801929 2.393134 -0.7909
H  -4.546871 4.012434 -0.064578
