program: Orca
programVersion: 4.2.1
elementType: O O N N N C C C C C C C C C C C C C C C C C C C C H H H H H H H H H H H H H H H H H H H H H H H
charge: 0
multiplicity: 1
keywords: wb97x-d3
keywords: def2-TZVPP
keywords: def2/J RIJCOSX GRIDX6 NOFINALGRIDX
keywords: grid4 nofinalgrid
keywords: scfconv7
keywords: smallprint printgap noloewdin
keywords: NOSOSCF
formula: C20H23N3O2
InChI: InChI=1S/C20H23N3O2/c1-20(2,3)18(24)19(23-14-21-13-22-23)25-17-11-9-16(10-12-17)15-7-5-4-6-8-15/h4-14,18-19,24H,1-3H3
48 atoms
O  -3.576516 -1.161349 -1.548477
O  -1.041156 -1.05291 -0.562804
N  -2.083923 0.987567 -0.111672
N  -2.40262 1.431901 -1.334493
N  -2.083048 3.152443 0.064564
C  -4.599669 -0.742073 0.657066
C  -3.351244 -1.158578 -0.159575
C  -2.044855 -0.427481 0.189474
C  -4.275727 -0.756079 2.151908
C  -5.172669 0.623852 0.270971
C  -5.675223 -1.800006 0.386468
C  0.274286 -0.794798 -0.324679
C  -1.900614 2.026247 0.707471
C  1.161277 -1.318532 -1.261617
C  0.767295 -0.085738 0.763176
C  -2.3905 2.729772 -1.177089
C  3.039638 -0.416372 -0.028965
C  2.521803 -1.136246 -1.108314
C  2.137098 0.099584 0.896107
C  4.493334 -0.2141 0.124255
C  5.003993 1.010186 0.55932
C  5.390987 -1.24369 -0.16448
C  6.370973 1.199323 0.700294
C  6.757698 -1.054931 -0.022371
C  7.253862 0.167712 0.410069
H  -3.149315 -2.200232 0.115226
H  -1.856029 -0.516589 1.261979
H  -3.618747 0.063143 2.451529
H  -5.192037 -0.649529 2.73479
H  -3.80351 -1.693039 2.456887
H  -5.379703 0.702004 -0.797352
H  -4.536199 1.46078 0.558449
H  -6.123821 0.773236 0.785447
H  -5.96977 -1.82265 -0.662978
H  -6.57042 -1.588873 0.973947
H  -5.332183 -2.800752 0.659591
H  -3.544037 -0.250114 -1.871591
H  -1.646258 1.923045 1.750775
H  0.778068 -1.86612 -2.113102
H  0.125936 0.311277 1.53663
H  -2.60891 3.400092 -1.992939
H  3.187734 -1.54281 -1.858846
H  2.498662 0.643015 1.759768
H  4.329685 1.830601 0.771685
H  5.019363 -2.208875 -0.485537
H  6.746857 2.158336 1.032068
H  7.435964 -1.868233 -0.244939
H  8.320066 0.315218 0.520018
elementType: O N C H
totalener: -1090.77615942 hartree
nucrepener: 2140.92836207 hartree
electener: -3231.70452149 hartree
oneelecener: -5734.51135738 hartree
twoeener: 2502.80683589 hartree
cpcmener: -0.03874646 hartree
kineticenergy: 1086.01477267 hartree
xcener: -106.817489205991 hartree
chargesum: -0.0000000
charge: -0.451548 -0.303262 0.134118 -0.383278 -0.395664 0.209912 0.137190 0.066959 -0.355861 -0.364587 -0.335958 0.318522 0.066182 -0.263152 -0.216958 0.097535 0.115334 -0.153756 -0.222317 0.101128 -0.206261 -0.214731 -0.177725 -0.172002 -0.155525 0.111418 0.161704 0.090539 0.103179 0.112103 0.100110 0.098641 0.106070 0.097434 0.095046 0.096756 0.237371 0.183724 0.142795 0.144781 0.166573 0.149003 0.149039 0.149239 0.146443 0.160452 0.160607 0.162674
qa: -0.4515 -0.3033 0.1341 -0.3833 -0.3957 0.2099 0.1372 0.0670 -0.3559 -0.3646 -0.3360 0.3185 0.0662 -0.2632 -0.2170 0.0975 0.1153 -0.1538 -0.2223 0.1011 -0.2063 -0.2147 -0.1777 -0.1720 -0.1555 0.1114 0.1617 0.0905 0.1032 0.1121 0.1001 0.0986 0.1061 0.0974 0.0950 0.0968 0.2374 0.1837 0.1428 0.1448 0.1666 0.1490 0.1490 0.1492 0.1464 0.1605 0.1606 0.1627
va: 1.9802 2.1084 3.2358 2.8516 3.0446 3.7370 3.9448 3.9900 3.9565 3.9517 3.9086 3.7213 4.0532 4.0415 3.9119 4.0011 3.5536 3.9407 4.0146 3.5067 3.9327 3.9409 3.9149 3.9135 3.8825 1.0137 0.9728 0.9990 1.0062 1.0027 1.0143 0.9995 1.0083 1.0188 1.0070 1.0041 1.0358 0.9911 1.0126 1.0106 0.9927 1.0000 1.0040 1.0036 1.0055 0.9923 0.9921 0.9887
dispcorr: -0.024648648 hartree
energy: -1090.800808063145
dipole: -19.85292 19.91995 0.06703 -4.94043 4.80674 -0.13369 8.77905 -6.96233 1.81672
magnitude: 1.82287 au
magnitude: 4.63337 debye
