program: Orca
programVersion: 4.2.1
elementType: O O N N N C C C C C C C C C C C C C C C C C C C C H H H H H H H H H H H H H H H H H H H H H H H
charge: 0
multiplicity: 1
keywords: wb97x-d3
keywords: def2-TZVPP
keywords: def2/J RIJCOSX GRIDX6 NOFINALGRIDX
keywords: grid4 nofinalgrid
keywords: scfconv7
keywords: smallprint printgap noloewdin
keywords: NOSOSCF
formula: C20H23N3O2
InChI: InChI=1S/C20H23N3O2/c1-20(2,3)18(24)19(23-14-21-13-22-23)25-17-11-9-16(10-12-17)15-7-5-4-6-8-15/h4-14,18-19,24H,1-3H3
48 atoms
O  -4.569422 0.438542 -0.390204
O  -1.246049 -0.730768 -0.56133
N  -2.144001 1.402901 -0.749477
N  -2.273967 2.560924 -0.100918
N  -2.192335 2.901148 -2.310312
C  -3.931361 -1.484454 0.991245
C  -3.577138 -0.528649 -0.173728
C  -2.188219 0.146013 -0.029128
C  -5.192049 -2.257566 0.595307
C  -2.808046 -2.490541 1.250271
C  -4.207957 -0.709596 2.282942
C  0.079046 -0.556756 -0.302561
C  -2.109411 1.61548 -2.067232
C  0.915253 -1.565043 -0.77288
C  0.621319 0.531288 0.369921
C  -2.294414 3.432423 -1.076197
C  2.851531 -0.390814 0.08357
C  2.280579 -1.47952 -0.57964
C  1.995785 0.600804 0.553945
C  4.312246 -0.28802 0.269591
C  5.074526 -1.408321 0.605031
C  4.965074 0.935772 0.109985
C  6.44708 -1.306993 0.777835
C  6.337331 1.037007 0.282635
C  7.084472 -0.084041 0.617793
H  -3.53714 -1.117722 -1.096988
H  -1.973574 0.397726 1.015112
H  -5.486589 -2.942391 1.392857
H  -6.037312 -1.595805 0.403408
H  -5.026711 -2.855644 -0.303889
H  -2.528189 -3.038094 0.348723
H  -3.142235 -3.225147 1.98584
H  -1.906873 -2.029862 1.658961
H  -3.361016 -0.099086 2.604858
H  -4.416303 -1.406666 3.096428
H  -5.082169 -0.058473 2.209982
H  -4.728338 0.936795 0.418997
H  -2.013695 0.828588 -2.798845
H  0.491136 -2.41076 -1.299658
H  0.012567 1.337273 0.756475
H  -2.381477 4.491808 -0.891606
H  2.911496 -2.266149 -0.974247
H  2.39756 1.450502 1.091625
H  4.590575 -2.365994 0.753917
H  4.399863 1.814833 -0.174757
H  7.019145 -2.185894 1.046351
H  6.82453 1.993908 0.145461
H  8.155517 -0.005329 0.752224
elementType: O N C H
totalener: -1090.78490881 hartree
nucrepener: 2135.14888632 hartree
electener: -3225.93379514 hartree
oneelecener: -5722.79158326 hartree
twoeener: 2496.85778812 hartree
cpcmener: -0.02905666 hartree
kineticenergy: 1086.00501106 hartree
xcener: -106.808614625914 hartree
chargesum: -0.0000000
charge: -0.407288 -0.303151 0.139495 -0.360539 -0.402189 0.179402 0.161424 0.012039 -0.329835 -0.320127 -0.345818 0.297889 0.065879 -0.251165 -0.172167 0.069320 0.120009 -0.153448 -0.227970 0.101894 -0.212210 -0.208222 -0.171500 -0.170898 -0.149996 0.106769 0.162692 0.097283 0.097801 0.097550 0.100389 0.099207 0.084234 0.102841 0.101162 0.096260 0.218804 0.178749 0.141339 0.133758 0.163903 0.146534 0.147113 0.144736 0.146246 0.156887 0.156666 0.158249
qa: -0.4073 -0.3032 0.1395 -0.3605 -0.4022 0.1794 0.1614 0.0120 -0.3298 -0.3201 -0.3458 0.2979 0.0659 -0.2512 -0.1722 0.0693 0.1200 -0.1534 -0.2280 0.1019 -0.2122 -0.2082 -0.1715 -0.1709 -0.1500 0.1068 0.1627 0.0973 0.0978 0.0976 0.1004 0.0992 0.0842 0.1028 0.1012 0.0963 0.2188 0.1787 0.1413 0.1338 0.1639 0.1465 0.1471 0.1447 0.1462 0.1569 0.1567 0.1582
va: 2.0349 2.0536 3.3028 2.8689 3.0436 3.8444 3.8907 3.9905 3.9060 3.9458 3.9379 3.7177 4.0857 4.0473 3.9166 4.0391 3.5531 3.9449 4.0253 3.5124 3.9471 3.9420 3.9226 3.9204 3.8897 1.0154 0.9770 1.0059 1.0198 1.0033 1.0095 1.0065 1.0063 1.0061 1.0031 1.0095 1.0252 0.9954 1.0108 1.0309 0.9931 1.0013 1.0030 1.0057 1.0048 0.9934 0.9934 0.9903
dispcorr: -0.024323144 hartree
energy: -1090.809231958084
dipole: -13.99220 14.16613 0.17393 -13.55445 12.21112 -1.34332 11.47136 -10.18856 1.28280
magnitude: 1.86557 au
magnitude: 4.74190 debye
