program: Orca
programVersion: 4.2.1
elementType: O O N N N C C C C C C C C C C C C C C C C C C C C H H H H H H H H H H H H H H H H H H H H H H H
charge: 0
multiplicity: 1
keywords: wb97x-d3
keywords: def2-TZVPP
keywords: def2/J RIJCOSX GRIDX6 NOFINALGRIDX
keywords: grid4 nofinalgrid
keywords: scfconv7
keywords: smallprint printgap noloewdin
keywords: NOSOSCF
formula: C20H23N3O2
InChI: InChI=1S/C20H23N3O2/c1-20(2,3)18(24)19(23-14-21-13-22-23)25-17-11-9-16(10-12-17)15-7-5-4-6-8-15/h4-14,18-19,24H,1-3H3
48 atoms
O  -3.762092 -0.934779 -1.410072
O  -1.075094 -1.002067 -0.596083
N  -2.160166 1.043393 -0.337419
N  -2.091509 2.05931 0.530259
N  -2.269371 2.829155 -1.560991
C  -4.490073 -0.889355 0.941376
C  -3.35762 -1.142251 -0.081016
C  -2.073411 -0.3309 0.122983
C  -5.013769 0.54558 0.928691
C  -5.644572 -1.832124 0.582101
C  -3.997204 -1.248613 2.34438
C  0.237212 -0.729529 -0.371162
C  -2.255336 1.519361 -1.585351
C  1.138873 -1.495814 -1.105793
C  0.715501 0.225428 0.518127
C  -2.169185 3.107637 -0.245272
C  3.003247 -0.360046 -0.056866
C  2.498339 -1.312818 -0.945458
C  2.085593 0.398761 0.662917
C  4.457049 -0.171431 0.115212
C  5.002473 1.10377 0.274941
C  5.321467 -1.267895 0.126561
C  6.368483 1.276362 0.442075
C  6.687393 -1.095329 0.292534
C  7.217312 0.177808 0.451493
H  -3.046185 -2.186053 0.069865
H  -1.833387 -0.277805 1.187235
H  -5.278328 0.875657 -0.077297
H  -5.91673 0.616371 1.539065
H  -4.297923 1.256083 1.341023
H  -6.114118 -1.571402 -0.367918
H  -6.425714 -1.777241 1.3420
H  -5.321556 -2.874752 0.525915
H  -3.245844 -0.553182 2.720451
H  -3.566501 -2.25148 2.379544
H  -4.824312 -1.228245 3.0554
H  -4.260793 -1.700382 -1.710103
H  -2.298346 0.896963 -2.463042
H  0.76845 -2.234722 -1.805334
H  0.058754 0.845919 1.111716
H  -2.1483 4.111065 0.150469
H  3.176224 -1.912522 -1.539912
H  2.432888 1.135965 1.375947
H  4.358343 1.974198 0.248333
H  4.922736 -2.269996 0.026446
H  6.771338 2.274436 0.556946
H  7.338079 -1.96031 0.305877
H  8.283219 0.312619 0.58178
elementType: O N C H
totalener: -1090.78548819 hartree
nucrepener: 2135.72216639 hartree
electener: -3226.50765458 hartree
oneelecener: -5724.61408895 hartree
twoeener: 2498.10643437 hartree
cpcmener: -0.02952371 hartree
kineticenergy: 1086.01387199 hartree
xcener: -106.813616850191 hartree
chargesum: 0.0000000
charge: -0.394474 -0.304437 0.112182 -0.361186 -0.397659 0.215844 0.122196 0.086867 -0.369503 -0.344669 -0.357236 0.312292 0.080483 -0.271812 -0.193074 0.087424 0.116823 -0.151077 -0.225862 0.101722 -0.206989 -0.214091 -0.169964 -0.168629 -0.152154 0.108567 0.169094 0.099916 0.102511 0.098624 0.095539 0.093343 0.107119 0.094386 0.105882 0.099710 0.219205 0.166399 0.139331 0.135009 0.163747 0.145758 0.144447 0.144263 0.143423 0.156441 0.156351 0.157918
qa: -0.3945 -0.3044 0.1122 -0.3612 -0.3977 0.2158 0.1222 0.0869 -0.3695 -0.3447 -0.3572 0.3123 0.0805 -0.2718 -0.1931 0.0874 0.1168 -0.1511 -0.2259 0.1017 -0.2070 -0.2141 -0.1700 -0.1686 -0.1522 0.1086 0.1691 0.0999 0.1025 0.0986 0.0955 0.0933 0.1071 0.0944 0.1059 0.0997 0.2192 0.1664 0.1393 0.1350 0.1637 0.1458 0.1444 0.1443 0.1434 0.1564 0.1564 0.1579
va: 2.0274 2.0949 3.2802 2.8444 3.0640 3.6860 3.9468 3.9351 3.9289 3.9089 3.9409 3.7488 4.0730 4.0481 3.9004 4.0070 3.5652 3.9416 4.0246 3.5187 3.9425 3.9484 3.9179 3.9200 3.8918 1.0144 0.9799 1.0175 1.0071 1.0151 1.0123 1.0080 1.0009 1.0049 1.0046 1.0046 1.0163 1.0181 1.0130 1.0370 0.9936 1.0008 1.0048 1.0054 1.0061 0.9933 0.9935 0.9904
dispcorr: -0.024196957 hartree
energy: -1090.809685149289
dipole: -19.28391 18.71567 -0.56824 -8.04868 6.15799 -1.89069 9.84124 -9.12706 0.71419
magnitude: 2.09944 au
magnitude: 5.33636 debye
