program: Orca
programVersion: 4.2.1
elementType: O O N N N C C C C C C C C C C C C C C C C C C C C H H H H H H H H H H H H H H H H H H H H H H H
charge: 0
multiplicity: 1
keywords: wb97x-d3
keywords: def2-TZVPP
keywords: def2/J RIJCOSX GRIDX6 NOFINALGRIDX
keywords: grid4 nofinalgrid
keywords: scfconv7
keywords: smallprint printgap noloewdin
keywords: NOSOSCF
formula: C20H23N3O2
InChI: InChI=1S/C20H23N3O2/c1-20(2,3)18(24)19(23-14-21-13-22-23)25-17-11-9-16(10-12-17)15-7-5-4-6-8-15/h4-14,18-19,24H,1-3H3
48 atoms
O  -3.836528 -0.679409 -1.554661
O  -1.072677 -0.837182 -0.801517
N  -2.157403 1.111635 -0.142951
N  -2.17208 1.945656 0.903469
N  -2.281151 3.097057 -1.015097
C  -4.446736 -1.084107 0.798177
C  -3.355845 -1.077004 -0.300174
C  -2.054668 -0.32186 0.043504
C  -5.097148 0.284901 1.019654
C  -5.527109 -2.080534 0.35987
C  -3.853347 -1.570667 2.123445
C  0.242654 -0.626228 -0.524237
C  -2.214458 1.817839 -1.284515
C  0.724027 0.158269 0.516321
C  1.139752 -1.272963 -1.369093
C  -2.255529 3.122647 0.332839
C  3.008034 -0.362694 -0.128226
C  2.094686 0.277256 0.701263
C  2.498847 -1.140769 -1.169481
C  4.461237 -0.218482 0.076363
C  5.321186 -0.053645 -1.009107
C  5.011277 -0.240355 1.357708
C  6.686919 0.083451 -0.8204
C  6.376521 -0.099315 1.548184
C  7.220724 0.062356 0.459611
H  -3.039553 -2.119305 -0.41869
H  -1.79398 -0.467456 1.095167
H  -5.57497 0.684445 0.120387
H  -5.892933 0.194256 1.760568
H  -4.395466 1.030301 1.389712
H  -5.116823 -3.085394 0.238887
H  -5.989248 -1.798671 -0.585877
H  -6.317018 -2.136372 1.110565
H  -3.205896 -0.828591 2.592973
H  -3.278651 -2.491245 1.996382
H  -4.651894 -1.784958 2.834867
H  -4.397742 0.093683 -1.443893
H  -2.181969 1.369309 -2.264244
H  0.067568 0.707936 1.17671
H  0.75898 -1.889203 -2.173072
H  -2.290872 4.033133 0.910061
H  2.452311 0.916308 1.498675
H  3.178547 -1.674424 -1.821759
H  4.91344 -0.005717 -2.011192
H  4.365708 -0.393531 2.213641
H  7.335151 0.217843 -1.676434
H  6.783327 -0.125268 2.550654
H  8.286908 0.171279 0.607702
totalener: -1090.75571984 hartree
nucrepener: 2134.43355470 hartree
electener: -3225.18927454 hartree
oneelecener: -5720.92276771 hartree
twoeener: 2495.73349318 hartree
kineticenergy: 1086.01953684 hartree
xcener: -106.810277493817 hartree
chargesum: 0.0000000
charge: -0.356463 -0.281321 0.097761 -0.345914 -0.318531 0.154234 0.158477 0.069624 -0.345442 -0.286515 -0.360295 0.275824 0.004714 -0.155846 -0.231484 0.087852 0.128495 -0.218957 -0.136969 0.113882 -0.197786 -0.190091 -0.134397 -0.137120 -0.117785 0.087651 0.152526 0.078590 0.095755 0.119473 0.088821 0.097759 0.086106 0.097854 0.105474 0.095542 0.193617 0.176217 0.119105 0.123471 0.136264 0.125572 0.124753 0.123628 0.123126 0.123877 0.123886 0.124988
qa: -0.3565 -0.2813 0.0978 -0.3459 -0.3185 0.1542 0.1585 0.0696 -0.3454 -0.2865 -0.3603 0.2758 0.0047 -0.1558 -0.2315 0.0879 0.1285 -0.2190 -0.1370 0.1139 -0.1978 -0.1901 -0.1344 -0.1371 -0.1178 0.0877 0.1525 0.0786 0.0958 0.1195 0.0888 0.0978 0.0861 0.0979 0.1055 0.0955 0.1936 0.1762 0.1191 0.1235 0.1363 0.1256 0.1248 0.1236 0.1231 0.1239 0.1239 0.1250
va: 2.0812 2.1040 3.2748 2.8132 3.0773 3.8013 4.0042 3.8911 3.9295 3.9126 3.9336 3.8479 4.0956 3.9206 4.0677 4.0049 3.6316 4.0689 3.9682 3.5805 3.9981 3.9898 3.9753 3.9775 3.9559 1.0205 0.9894 1.0146 1.0096 1.0177 1.0080 1.0197 1.0093 1.0049 1.0042 1.0091 1.0504 1.0048 1.0400 1.0169 0.9988 1.0100 1.0068 1.0104 1.0099 1.0029 1.0027 1.0000
dispcorr: -0.024385567 hartree
energy: -1090.780105407559
dipole: -18.90119 18.54128 -0.35991 -8.81150 8.12124 -0.69025 8.98067 -8.34619 0.63448
magnitude: 1.00426 au
magnitude: 2.55263 debye
