program: Gaussian 16
title: diene product
version: AS64L-G16RevC.01
method: RB3LYP
basis: def2SVP
operation: Freq
keyword: #NGeom=AllCheck
keyword: Guess=TCheck
keyword: SCRF=Check
keyword: GenChk
keyword: RB3LYP/def2SVP
keyword: Freq
keyword: #N
keyword: Geom=AllCheck
hfenergy: -768.0181267 hartree
pointgroup: C01 [X(C16H14O2)]
dipole: 1.6757442 -2.4270626 1.0105373 debye
polarizability: 478.75958|-22.2025113|304.7218049|31.4687828|-26.0023029|136.3571901 unknown
InChI: InChI=1S/C16H14O2/c1-2-6-13(7-3-1)12-14-8-4-5-9-15(14)16-17-10-11-18-16/h1-9,12H,10-11H2
charge 0 multiplicity 1
32 atoms
C  1.50342662 2.65163655 -0.5661063
C  0.40632487 1.85998101 -0.40106137
C  0.47750525 0.46466256 0.01953233
C  1.85532168 -0.03266974 0.27912478
C  2.98564861 0.85454824 0.07526141
C  2.82913053 2.14851774 -0.31784517
H  1.37825918 3.67846857 -0.92212413
H  -0.57215811 2.26557082 -0.65558723
H  3.98575279 0.45537752 0.25283122
H  3.69716813 2.79627091 -0.46167402
C  -0.65590837 -0.32544699 0.10626396
H  -0.50754321 -1.39780731 0.21940519
C  2.15402946 -1.29080105 0.77163379
O  3.40016398 -1.66478592 1.10679918
C  3.39593594 -3.08112919 1.38174813
H  3.72280782 -3.62161042 0.47829082
H  4.08682843 -3.28064756 2.21039579
C  -2.06708426 0.05524482 0.03066112
C  -2.99460682 -0.89690537 -0.46410192
C  -2.5998214 1.28551122 0.49019641
C  -4.35967998 -0.62149513 -0.54019313
H  -2.62161827 -1.86778562 -0.80398941
C  -3.9672077 1.5594117 0.4145699
H  -1.93891065 2.02333365 0.9478716
C  -4.85806382 0.61478162 -0.10889276
H  -5.04231171 -1.37789733 -0.93834886
H  -4.3429446 2.51830161 0.78355659
H  -5.92771741 0.83289693 -0.16649563
O  1.27231602 -2.26930514 0.99592572
C  1.93349582 -3.33393956 1.72021081
H  1.54612045 -4.29462589 1.35908409
H  1.71567443 -3.21578661 2.79367437
