program: Gaussian 16
title: acetal ring closure
version: AS64L-G16RevC.01
method: RB3LYP
basis: def2SVP
operation: Freq
keyword: #NGeom=AllCheck
keyword: Guess=TCheck
keyword: SCRF=Check
keyword: GenChk
keyword: RB3LYP/def2SVP
keyword: Freq
keyword: #N
keyword: Geom=AllCheck
hfenergy: -767.9826396 hartree
pointgroup: C01 [X(C16H14O2)]
dipole: 1.4102642 2.2249591 0.4785632 debye
polarizability: 461.4818916|-1.9453215|279.6118664|6.7032919|-25.9134108|164.5805287 unknown
InChI: InChI=1S/C16H14O2/c1-2-6-13(7-3-1)12-14-8-4-5-9-15(14)16-17-10-11-18-16/h1-9,12H,10-11H2
charge 0 multiplicity 1
32 atoms
C  1.82471469 -3.2055744 0.04809377
C  0.61026467 -2.54799305 -0.13401058
C  0.62698949 -1.14743761 -0.33083201
C  1.84594883 -0.46100199 -0.13634434
C  3.08477171 -1.11979815 -0.04876067
C  3.05797638 -2.50892051 0.05018644
H  1.83340424 -4.2941682 0.15660125
H  -0.32347767 -3.11217594 -0.19802573
H  4.0228308 -0.56228723 0.01290453
H  3.99088652 -3.06581293 0.1701494
C  -0.37747407 -0.22218608 -0.81859884
C  1.54847795 0.95274795 0.00031615
C  -1.76837265 -0.18798993 -0.43367477
C  -2.24853119 -0.844984 0.73114854
C  -2.71543163 0.55586431 -1.18880793
C  -3.59255 -0.77974367 1.0987258
H  -1.54556516 -1.40084164 1.35659472
C  -4.05477744 0.62558758 -0.81124536
H  -2.37739597 1.08091587 -2.08774176
C  -4.50967084 -0.04559602 0.33397407
H  -3.92894357 -1.30029312 2.00053973
H  -4.75691013 1.20600518 -1.4174871
H  -5.56119277 0.00773253 0.62779195
H  -0.10622963 0.31756406 -1.7300296
O  2.21006605 1.88318488 -0.69127806
C  2.02432784 3.16926733 -0.04260504
C  0.87252425 2.87487331 0.91471408
O  1.02037612 1.4580161 1.1254159
H  0.95013633 3.38286884 1.88345323
H  -0.11255599 3.06720152 0.45743451
H  2.96075951 3.43139363 0.47395297
H  1.79053034 3.92103837 -0.80718623
