program: Orca
programVersion: 4.2.1
elementType: Cl Cl Cl O O N N N C C C C C C C C C C C C C C C H H H H H H H H H H H H H H H H
charge: 0
multiplicity: 1
keywords: wb97x-d3
keywords: def2-TZVPP
keywords: def2/J RIJCOSX GRIDX6 NOFINALGRIDX
keywords: grid4 nofinalgrid
keywords: scfconv7
keywords: smallprint printgap noloewdin
keywords: NOSOSCF
formula: C15H16Cl3N3O2
InChI: InChI=1S/C15H16Cl3N3O2/c1-2-4-20(15(22)21-5-3-19-10-21)6-7-23-14-12(17)8-11(16)9-13(14)18/h3,5,8-10H,2,4,6-7H2,1H3
39 atoms
Cl 2.190162 -2.639228 -1.737753
Cl 0.8080 1.356218 1.563155
Cl 5.981677 0.442933 0.488876
O  0.339002 -0.897759 -0.290487
O  -2.763094 -0.715098 -1.952855
N  -2.382129 -0.6234 0.290655
N  -3.134412 1.253083 -0.890844
N  -4.342538 3.026049 -1.388621
C  -2.757981 -0.07401 1.593404
C  -1.720403 -1.918203 0.31561
C  -4.044002 -0.676866 2.142751
C  -0.253729 -1.790558 0.656288
C  -2.74411 -0.115954 -0.894275
C  -5.27636 -0.389636 1.30105
C  1.635353 -0.608123 -0.07854
C  -2.436009 2.342191 -0.421856
C  -4.266314 1.729708 -1.47215
C  2.642402 -1.333649 -0.711187
C  2.023114 0.439404 0.753522
C  -3.197342 3.419455 -0.743989
C  3.981458 -1.021446 -0.551963
C  3.352826 0.777243 0.936242
C  4.317652 0.034977 0.27723
H  -1.93696 -0.267483 2.284171
H  -2.855337 1.007213 1.540334
H  -1.843314 -2.414127 -0.643563
H  -2.189335 -2.559762 1.063282
H  -4.179682 -0.261869 3.144132
H  -3.926834 -1.755088 2.277729
H  -0.109307 -1.415669 1.673282
H  0.208862 -2.779968 0.600666
H  -6.167956 -0.793603 1.781169
H  -5.434146 0.682626 1.170636
H  -5.219924 -0.84644 0.31157
H  -1.469064 2.260265 0.04378
H  -5.000898 1.080521 -1.921103
H  -2.976878 4.456974 -0.552619
H  4.742944 -1.594966 -1.06069
H  3.626141 1.599949 1.581418
elementType: Cl O N C H
totalener: -2276.65512804 hartree
nucrepener: 2416.08593413 hartree
electener: -4692.74106217 hartree
oneelecener: -7930.67451929 hartree
twoeener: 3237.93345712 hartree
cpcmener: -0.03685503 hartree
kineticenergy: 2270.84920230 hartree
xcener: -149.627553723691 hartree
chargesum: 0.0000000
charge: -0.063953 -0.073789 -0.076022 -0.336899 -0.490778 -0.090805 -0.012833 -0.385833 -0.082111 -0.031907 -0.092466 -0.053508 0.328791 -0.291250 0.247731 -0.163083 0.049400 -0.024963 0.023985 -0.129521 -0.095238 -0.108714 0.045440 0.104903 0.123238 0.103461 0.116170 0.076775 0.066617 0.115142 0.126523 0.105842 0.089077 0.080150 0.183956 0.176625 0.172066 0.132102 0.135679
qa: -0.0640 -0.0738 -0.0760 -0.3369 -0.4908 -0.0908 -0.0128 -0.3858 -0.0821 -0.0319 -0.0925 -0.0535 0.3288 -0.2912 0.2477 -0.1631 0.0494 -0.0250 0.0240 -0.1295 -0.0952 -0.1087 0.0454 0.1049 0.1232 0.1035 0.1162 0.0768 0.0666 0.1151 0.1265 0.1058 0.0891 0.0802 0.1840 0.1766 0.1721 0.1321 0.1357
va: 1.2494 1.2401 1.2242 1.9988 2.0095 3.1188 3.2095 3.1132 3.8778 3.8548 3.8857 3.8685 4.2871 3.9404 3.8366 3.9008 4.0228 3.9606 3.9275 4.0829 4.0200 4.0256 3.9146 1.0078 0.9922 1.0376 1.0066 1.0121 1.0095 0.9960 1.0075 1.0067 0.9989 1.0021 1.0181 0.9970 1.0009 1.0143 1.0121
dispcorr: -0.023417867 hartree
energy: -2276.678545904706
dipole: -44.77004 45.86566 1.09563 -2.30682 0.70956 -1.59726 12.06334 -8.75129 3.31205
magnitude: 3.83684 au
magnitude: 9.75246 debye
