program: Orca
programVersion: 4.2.1
elementType: Cl Cl Cl O O N N N C C C C C C C C C C C C C C C H H H H H H H H H H H H H H H H
charge: 0
multiplicity: 1
keywords: wb97x-d3
keywords: def2-TZVPP
keywords: def2/J RIJCOSX GRIDX6 NOFINALGRIDX
keywords: grid4 nofinalgrid
keywords: scfconv7
keywords: smallprint printgap noloewdin
keywords: NOSOSCF
formula: C15H16Cl3N3O2
InChI: InChI=1S/C15H16Cl3N3O2/c1-2-4-20(15(22)21-5-3-19-10-21)6-7-23-14-12(17)8-11(16)9-13(14)18/h3,5,8-10H,2,4,6-7H2,1H3
39 atoms
Cl 0.45141 1.814962 0.270693
Cl 2.103985 -3.293632 -0.191081
Cl 4.000577 0.462358 -3.498454
O  0.457795 -1.033305 0.92192
O  -3.21823 1.784956 0.431999
N  -2.414272 -0.31868 0.541649
N  -2.308512 1.158393 2.404607
N  -1.195876 1.458259 4.287076
C  -2.836607 -0.549779 -0.841899
C  -1.900981 -1.474452 1.254226
C  -1.899042 -0.001526 -1.90862
C  -0.58465 -1.995687 0.717773
C  -2.656817 0.897603 1.0481
C  -2.448515 -0.281572 -3.298644
C  1.274968 -0.724493 -0.099828
C  -3.094704 1.958834 3.207187
C  -1.167886 0.903049 3.112781
C  1.37857 0.602064 -0.522566
C  2.083853 -1.661241 -0.74407
C  -2.400992 2.111143 4.360871
C  2.214886 0.981834 -1.55684
C  2.916766 -1.312293 -1.794199
C  2.966173 0.010418 -2.194142
H  -2.93975 -1.629249 -0.964244
H  -3.836499 -0.134558 -0.981208
H  -2.620147 -2.290979 1.151709
H  -1.830114 -1.281198 2.320567
H  -0.911517 -0.457835 -1.814462
H  -1.763073 1.072422 -1.774005
H  -0.346233 -2.9105 1.259692
H  -0.674108 -2.251319 -0.339984
H  -1.768293 0.082444 -4.068281
H  -2.589632 -1.351053 -3.464535
H  -3.412141 0.207011 -3.452502
H  -4.062313 2.316064 2.899907
H  -0.34198 0.337631 2.719359
H  -2.700503 2.65517 5.242011
H  2.266533 2.017001 -1.863186
H  3.525457 -2.063054 -2.277797
elementType: Cl O N C H
totalener: -2276.65457122 hartree
nucrepener: 2496.49850140 hartree
electener: -4773.15307262 hartree
oneelecener: -8091.47754805 hartree
twoeener: 3318.32447543 hartree
cpcmener: -0.03595668 hartree
kineticenergy: 2270.83572506 hartree
xcener: -149.631533592927 hartree
chargesum: 0.0000000
charge: -0.061173 -0.064767 -0.075710 -0.354155 -0.506228 -0.077108 -0.035401 -0.393559 -0.071726 -0.101180 -0.076090 0.005192 0.334048 -0.277270 0.224628 -0.126009 0.015122 0.003453 0.013366 -0.126598 -0.090809 -0.098163 0.044496 0.110019 0.101337 0.121665 0.125515 0.050194 0.073857 0.116045 0.124079 0.093755 0.084493 0.089179 0.181608 0.188937 0.170930 0.132745 0.131282
qa: -0.0612 -0.0648 -0.0757 -0.3542 -0.5062 -0.0771 -0.0354 -0.3936 -0.0717 -0.1012 -0.0761 0.0052 0.3340 -0.2773 0.2246 -0.1260 0.0151 0.0035 0.0134 -0.1266 -0.0908 -0.0982 0.0445 0.1100 0.1013 0.1217 0.1255 0.0502 0.0739 0.1160 0.1241 0.0938 0.0845 0.0892 0.1816 0.1889 0.1709 0.1327 0.1313
va: 1.2552 1.2470 1.2248 2.0001 1.9875 3.1706 3.2432 3.1301 3.8245 3.9242 3.8319 3.8095 4.2759 3.9681 3.7922 3.9291 4.0121 3.9290 3.9141 4.0348 4.0217 4.0269 3.9212 0.9999 1.0193 1.0037 1.0007 1.0152 1.0233 1.0036 0.9802 1.0024 1.0006 1.0011 0.9995 1.0163 0.9991 1.0143 1.0139
dispcorr: -0.025104392 hartree
energy: -2276.679675608166
dipole: -31.60513 31.11548 -0.48965 -3.82617 1.02477 -2.80139 -0.57659 -0.97534 -1.55193
magnitude: 3.23976 au
magnitude: 8.23483 debye
