program: Gaussian 09
title: 000030025
version: EM64L-G09RevD.01
frameworkgroup: C1[X(C12H14N2O4)]
method: RPBEPBE
basis: SDD
operation: Freq
keyword: #p
keyword: freq=noraman
keyword: PBEPBE/SDD
title: #p freq=noraman PBEPBE/SDD
converged: YES YES NO NO
title: Mulliken charges:
elementType: O O O O N N C C C C C C C C C C C C H H H H H H H H H H H H H H
charge: -0.244310 -0.166477 -0.383414 -0.259941 -0.406436 0.122114 0.111393 0.224697 -0.352033 -0.359871 -0.248213 0.170860 -0.251859 -0.220098 -0.678197 0.027075 -0.789416 0.148853 0.255396 0.250332 0.206580 0.214866 0.235258 0.230811 0.205000 0.246476 0.232163 0.326520 0.297497 0.233040 0.238733 0.382603
chargesum: 0.00000
title: Mulliken charges with hydrogens summed into heavy atoms:
elementType: O O O O N N C C C C C C C C C C C C
charge: -0.244310 -0.166477 -0.000812 -0.259941 -0.079916 0.122114 0.111393 0.224697 -0.096638 -0.109539 0.173232 0.170860 -0.016601 0.010713 0.005442 0.027075 -0.020146 0.148853
polarizability: 2.54813398e+02 -7.02939841e+00 1.72320489e+02 -3.77537600e+00 -8.64462318e+00 1.03896467e+02
1716.lowfreq: -5.3153 -3.1919 -0.0013 -0.0012 -0.0008 2.6015 21.1112 29.7415 50.3698
frequency: 21.0702 29.7377 50.3695 57.8249 66.2936 97.8555 109.4711 116.3988 129.7620 166.0475 173.9325 208.6365 232.1891 248.7477 275.0334 289.2951 301.3191 331.9543 384.2618 410.4121 435.8103 468.9949 488.8907 518.5324 565.5297 587.8516 593.1650 601.2846 652.2860 672.9901 696.6464 720.2952 738.9341 759.5767 762.0035 773.6851 824.4454 859.3826 880.0864 909.0833 942.2207 971.9721 979.6254 1008.8544 1029.0185 1035.5805 1043.0418 1046.6465 1112.7095 1123.5643 1133.1541 1140.6457 1176.2772 1200.4158 1219.3324 1233.4327 1261.9379 1276.6866 1359.6431 1360.6769 1382.7403 1386.2795 1401.9191 1428.6144 1437.4954 1459.2996 1469.4551 1480.8510 1487.0169 1489.1863 1491.6571 1550.5887 1585.8825 1598.5829 1607.5182 1651.1721 2957.9707 2964.8726 3000.3187 3019.8673 3037.1940 3097.3006 3112.5662 3118.4932 3127.2202 3138.0685 3162.0546 3173.7497 3391.0136 3519.3411
redmass: 5.7106 4.7722 4.9395 6.6054 3.9999 2.2794 5.1825 4.3269 3.6711 1.4845 2.4340 3.9170 1.3831 3.3824 8.4987 4.5803 4.0656 3.9463 4.6442 5.3393 4.4980 2.3890 4.6038 4.5099 4.7154 1.1902 6.1194 4.2432 5.5124 1.5177 5.4646 5.0667 4.4591 1.4029 3.8415 4.3060 1.1167 1.4245 3.8753 3.6375 1.4041 3.1310 1.3404 3.8956 2.6805 1.5321 2.5286 2.1960 2.2589 1.9450 1.4351 4.5203 1.0736 2.7979 2.2672 3.2503 1.1463 1.4879 2.8739 1.5301 4.1681 1.2936 1.2801 2.1932 1.2095 1.0392 1.4910 1.2704 1.0586 1.3067 1.3524 8.6971 7.0807 6.1652 8.3285 8.9287 1.0556 1.0398 1.0365 1.1075 1.0977 1.0989 1.1014 1.0950 1.0876 1.0891 1.0937 1.0990 1.0750 1.0641
irintensity: 1.6824 0.0393 1.5656 4.7885 0.9649 3.2213 0.5237 0.7792 2.1532 3.3270 1.2622 2.6977 0.5194 1.7021 0.2820 2.3481 1.0390 2.5401 4.0796 21.4301 2.5495 0.7033 4.5163 11.6148 14.4976 156.7937 6.8605 37.7564 12.2188 32.6475 27.0143 40.9705 10.2905 89.9732 2.3229 7.7187 2.4741 2.0666 91.9122 28.0480 5.2075 10.5970 1.7483 173.6789 71.5980 1.4047 161.8846 127.7468 7.7474 46.0788 6.2114 447.9549 8.4185 98.7528 91.2830 275.8856 0.3505 32.7743 101.2060 9.6042 17.9927 73.5012 38.9176 33.9327 163.8660 12.9720 80.7556 9.0361 24.9837 48.0270 83.3040 134.8923 26.6145 42.0274 279.2491 184.5666 46.0060 12.1283 21.5632 32.6109 16.9060 29.8671 26.7701 0.8775 5.7094 10.0840 22.0728 15.7040 2.4308 46.8065
temp: 298.150 k
press: 1.00000 atm
elementType: 8 8 8 8 7 7 6 6 6 6 6 6 6 6 6 6 6 6 1 1 1 1 1 1 1 1 1 1 1 1 1 1
symmnumber: 1
zpe: 643553.9 jmol-1
zpe.correction: 0.245117 hartree
zpe.thermalcorrener: 0.263389 hartree
zpe.thermalcorrenthalpy: 0.264333 hartree
zpe.thermalcorrgfe: 0.196559 hartree
zpe.sumelectzpe: -874.710500 hartree
zpe.sumelectthermal: -874.692228 hartree
zpe.sumelectthermalent: -874.691283 hartree
zpe.sumelectthermalfe: -874.759058 hartree
dipole: 4.5172 -2.7108 3.1933
dipole: 6.1604
quadrupole: -94.7843 -94.3863 -109.8463
quadrupole: 1.6999 7.7806 3.6908
quadrupole: 4.8880 5.2860 -10.1740 1.6999 7.7806 3.6908
hfenergy: -874.9556163 hartree
pointgroup: C01 [X(C12H14N2O4)]
dipole: -1.8553814 0.9325489 1.2498571 debye
polarizability: 255.4454952|1.2053144|172.2711301|0.8757405|6.6172528|103.3137286 unknown
InChI: InChI=1S/C12H14N2O4/c1-3-18-10-7-5-4-6-9(10)11(15)14-13-8(2)12(16)17/h4-7,14,16H,3H2,1-2H3
charge 0 multiplicity 1
32 atoms
O  -2.26596 -1.510012 0.391331
O  0.081664 -1.179964 -1.400348
O  4.850327 -0.972424 -0.887985
O  5.820488 0.455124 0.664074
N  1.146134 0.389314 0.003032
N  2.410955 -0.05631 -0.272463
C  -1.258844 0.549398 -0.290778
C  -2.422294 -0.147231 0.158998
C  -1.331475 1.949919 -0.491529
C  -3.630415 0.563484 0.377204
C  -3.452999 -2.305801 0.777092
C  0.007402 -0.194658 -0.635659
C  -2.532556 2.66056 -0.272245
C  -3.67875 1.957949 0.159044
C  -2.985396 -3.753968 0.884969
C  3.410994 0.495016 0.398977
C  3.284265 1.573756 1.456159
C  4.787475 0.013377 0.091716
H  -0.448603 2.480173 -0.868089
H  -4.52809 0.041707 0.719968
H  -3.847749 -1.932425 1.744588
H  -4.236243 -2.18925 0.000915
H  -2.575103 3.739675 -0.448789
H  -4.619183 2.49417 0.327808
H  -3.833863 -4.406136 1.161325
H  -2.572324 -4.098075 -0.077686
H  -2.20003 -3.854432 1.653032
H  0.968999 1.119571 0.709299
H  4.284019 1.834407 1.833533
H  2.819703 2.49378 1.047918
H  2.670957 1.232538 2.314032
H  5.805196 -1.224331 -1.014144
