program: Orca
programVersion: 4.2.1
elementType: Cl Cl Cl O O N N N C C C C C C C C C C C C C C C H H H H H H H H H H H H H H H H
charge: 0
multiplicity: 1
keywords: wb97x-d3
keywords: def2-TZVPP
keywords: def2/J RIJCOSX GRIDX6 NOFINALGRIDX
keywords: grid4 nofinalgrid
keywords: scfconv7
keywords: smallprint printgap noloewdin
keywords: NOSOSCF
formula: C15H16Cl3N3O2
InChI: InChI=1S/C15H16Cl3N3O2/c1-2-4-20(15(22)21-5-3-19-10-21)6-7-23-14-12(17)8-11(16)9-13(14)18/h3,5,8-10H,2,4,6-7H2,1H3
39 atoms
Cl 2.172081 -2.622889 -1.751337
Cl 0.829381 1.363374 1.577883
Cl 5.994627 0.415279 0.485244
O  0.338927 -0.878851 -0.27865
O  -2.756543 -0.700979 -1.949735
N  -2.387691 -0.610747 0.295541
N  -3.146092 1.265194 -0.889409
N  -4.312832 3.043613 -1.454714
C  -2.770864 -0.070081 1.598056
C  -1.722913 -1.903548 0.31402
C  -4.041835 -0.698037 2.158893
C  -0.254652 -1.778067 0.658763
C  -2.748054 -0.102492 -0.894965
C  -5.288628 -0.42655 1.333166
C  1.637833 -0.600616 -0.073074
C  -2.450414 2.353443 -0.41499
C  -4.249502 1.747324 -1.523274
C  2.636944 -1.329231 -0.715044
C  2.036257 0.440412 0.761964
C  -3.189626 3.435246 -0.775859
C  3.978743 -1.027192 -0.558125
C  3.369141 0.767409 0.941648
C  4.326859 0.021491 0.276238
H  -1.943123 -0.242932 2.287047
H  -2.893693 1.008542 1.544049
H  -1.841218 -2.391996 -0.650113
H  -2.190597 -2.553258 1.055705
H  -4.173587 -0.292748 3.165163
H  -3.907011 -1.775511 2.286069
H  -0.112554 -1.412495 1.679943
H  0.207482 -2.767892 0.597599
H  -6.169982 -0.836304 1.827347
H  -5.4594 0.643461 1.201544
H  -5.241099 -0.887296 0.34539
H  -1.500427 2.265991 0.083992
H  -4.971704 1.097698 -1.992715
H  -2.967638 4.474337 -0.590004
H  4.734241 -1.603009 -1.073896
H  3.650681 1.585801 1.589106
elementType: Cl O N C H
totalener: -2276.66556895 hartree
nucrepener: 2412.94770852 hartree
electener: -4689.61327747 hartree
oneelecener: -7924.40859473 hartree
twoeener: 3234.79531726 hartree
cpcmener: -0.03023682 hartree
kineticenergy: 2270.83662974 hartree
xcener: -149.623859307560 hartree
chargesum: -0.0000000
charge: -0.061310 -0.073950 -0.074113 -0.328784 -0.456730 -0.096267 -0.013172 -0.376512 -0.084354 -0.037415 -0.095647 -0.054568 0.316050 -0.287073 0.249088 -0.163000 0.052122 -0.029386 0.020436 -0.126495 -0.093895 -0.108100 0.043437 0.100962 0.122531 0.105250 0.113430 0.075917 0.065366 0.112045 0.124788 0.104256 0.089091 0.080919 0.180680 0.170933 0.167945 0.130999 0.134526
qa: -0.0613 -0.0739 -0.0741 -0.3288 -0.4567 -0.0963 -0.0132 -0.3765 -0.0844 -0.0374 -0.0956 -0.0546 0.3160 -0.2871 0.2491 -0.1630 0.0521 -0.0294 0.0204 -0.1265 -0.0939 -0.1081 0.0434 0.1010 0.1225 0.1053 0.1134 0.0759 0.0654 0.1120 0.1248 0.1043 0.0891 0.0809 0.1807 0.1709 0.1679 0.1310 0.1345
va: 1.2521 1.2398 1.2261 2.0055 2.0509 3.1047 3.2107 3.1180 3.8807 3.8591 3.8863 3.8708 4.3005 3.9399 3.8323 3.9062 4.0250 3.9683 3.9295 4.0833 4.0168 4.0234 3.9192 1.0081 0.9924 1.0381 1.0060 1.0119 1.0090 0.9955 1.0069 1.0067 0.9992 1.0025 1.0157 0.9994 1.0019 1.0147 1.0124
dispcorr: -0.023261214 hartree
energy: -2276.688830167627
dipole: -44.86474 45.87814 1.01341 -2.41261 0.85010 -1.56251 12.14820 -9.03175 3.11645
magnitude: 3.63052 au
magnitude: 9.22805 debye
