program: Orca
programVersion: 4.2.1
elementType: Cl Cl Cl O O N N N C C C C C C C C C C C C C C C H H H H H H H H H H H H H H H H
charge: 0
multiplicity: 1
keywords: wb97x-d3
keywords: def2-TZVPP
keywords: def2/J RIJCOSX GRIDX6 NOFINALGRIDX
keywords: grid4 nofinalgrid
keywords: scfconv7
keywords: smallprint printgap noloewdin
keywords: NOSOSCF
formula: C15H16Cl3N3O2
InChI: InChI=1S/C15H16Cl3N3O2/c1-2-4-20(15(22)21-5-3-19-10-21)6-7-23-14-12(17)8-11(16)9-13(14)18/h3,5,8-10H,2,4,6-7H2,1H3
39 atoms
Cl 2.804608 -2.594691 1.504529
Cl 0.115077 -0.041971 -2.399572
Cl 5.013467 1.599006 -0.981039
O  0.43662 -1.98898 -0.277011
O  -1.914159 0.069214 2.486204
N  -2.183295 -0.681054 0.362947
N  -2.483245 1.589137 0.902254
N  -3.270994 3.636924 1.082936
C  -2.991167 -0.628373 -0.856329
C  -1.728437 -2.005437 0.771465
C  -4.388637 -1.210215 -0.678899
C  -0.233917 -2.105747 0.98537
C  -2.1793 0.265861 1.317647
C  -5.264788 -0.445584 0.300218
C  1.496504 -1.179306 -0.391364
C  -1.983706 2.294861 -0.169756
C  -3.237488 2.459853 1.630296
C  2.660347 -1.304096 0.370101
C  1.489385 -0.185144 -1.371841
C  -2.482162 3.550752 -0.034644
C  3.740487 -0.452611 0.205393
C  2.560145 0.667279 -1.571803
C  3.673998 0.533142 -0.762161
H  -3.069893 0.394712 -1.215345
H  -2.454426 -1.182869 -1.62479
H  -2.025203 -2.714907 -0.000029
H  -2.22292 -2.325675 1.691171
H  -4.325046 -2.260335 -0.380211
H  -4.855625 -1.207594 -1.667014
H  0.118883 -1.347689 1.6859
H  -0.022846 -3.086026 1.41495
H  -4.89113 -0.499059 1.324313
H  -5.352566 0.60718 0.025256
H  -6.273115 -0.860762 0.315494
H  -1.311149 1.864844 -0.891988
H  -3.748634 2.162382 2.532719
H  -2.309899 4.39924 -0.67797
H  4.623888 -0.572107 0.816979
H  2.517029 1.426355 -2.340203
elementType: Cl O N C H
totalener: -2276.66481612 hartree
nucrepener: 2447.84457969 hartree
electener: -4724.50939581 hartree
oneelecener: -7994.05070713 hartree
twoeener: 3269.54131132 hartree
cpcmener: -0.02622440 hartree
kineticenergy: 2270.83764038 hartree
xcener: -149.624736283137 hartree
chargesum: -0.0000000
charge: -0.067336 -0.080731 -0.076536 -0.339010 -0.462040 -0.106063 -0.005481 -0.374859 -0.106576 -0.072426 -0.094204 -0.000606 0.317801 -0.284729 0.238072 -0.161772 0.054628 0.000521 0.008748 -0.128714 -0.095075 -0.093941 0.039475 0.125746 0.103275 0.104964 0.117066 0.067126 0.079131 0.123802 0.112047 0.080483 0.088906 0.104341 0.186190 0.170159 0.168588 0.130195 0.128833
qa: -0.0673 -0.0807 -0.0765 -0.3390 -0.4620 -0.1061 -0.0055 -0.3749 -0.1066 -0.0724 -0.0942 -0.0006 0.3178 -0.2847 0.2381 -0.1618 0.0546 0.0005 0.0087 -0.1287 -0.0951 -0.0939 0.0395 0.1257 0.1033 0.1050 0.1171 0.0671 0.0791 0.1238 0.1120 0.0805 0.0889 0.1043 0.1862 0.1702 0.1686 0.1302 0.1288
va: 1.2414 1.2274 1.2241 2.0395 2.0439 3.0917 3.2181 3.1215 3.8868 3.9309 3.8811 3.8269 4.2949 3.9384 3.8888 3.9001 4.0309 3.9043 3.8747 4.0893 4.0157 4.0168 3.9187 0.9911 1.0117 1.0084 1.0133 1.0104 1.0116 0.9962 1.0002 1.0026 1.0003 1.0061 1.0149 1.0014 1.0019 1.0144 1.0152
dispcorr: -0.023887282 hartree
energy: -2276.688703400562
dipole: -44.23290 44.00341 -0.22949 -3.31505 1.27612 -2.03893 3.52045 -4.90554 -1.38509
magnitude: 2.47555 au
magnitude: 6.29236 debye
