program: Orca
programVersion: 4.2.1
elementType: Cl Cl Cl O O N N N C C C C C C C C C C C C C C C H H H H H H H H H H H H H H H H
charge: 0
multiplicity: 1
keywords: wb97x-d3
keywords: def2-TZVPP
keywords: def2/J RIJCOSX GRIDX6 NOFINALGRIDX
keywords: grid4 nofinalgrid
keywords: scfconv7
keywords: smallprint printgap noloewdin
keywords: NOSOSCF
formula: C15H16Cl3N3O2
InChI: InChI=1S/C15H16Cl3N3O2/c1-2-4-20(15(22)21-5-3-19-10-21)6-7-23-14-12(17)8-11(16)9-13(14)18/h3,5,8-10H,2,4,6-7H2,1H3
39 atoms
Cl 2.810476 -2.520796 1.543566
Cl 0.07701 -0.205628 -2.470484
Cl 4.778576 1.822575 -0.892298
O  0.464691 -2.095384 -0.302851
O  -1.818611 -0.011653 2.440474
N  -2.140998 -0.728745 0.311918
N  -2.339577 1.546054 0.877871
N  -3.013728 3.630444 1.097291
C  -2.997471 -0.641191 -0.872614
C  -1.730947 -2.07435 0.70063
C  -4.405913 -1.175483 -0.639842
C  -0.243574 -2.223721 0.938023
C  -2.088346 0.207669 1.277106
C  -5.210196 -0.395574 0.38783
C  1.46512 -1.211022 -0.398423
C  -1.84602 2.232171 -0.209867
C  -3.020184 2.449997 1.637866
C  2.61022 -1.24586 0.400104
C  1.418263 -0.230398 -1.390679
C  -2.273704 3.510845 -0.050429
C  3.627851 -0.316121 0.264932
C  2.427057 0.7006 -1.560648
C  3.51844 0.657407 -0.711346
H  -3.054819 0.385891 -1.224301
H  -2.51401 -1.210221 -1.665339
H  -2.034112 -2.756888 -0.092307
H  -2.250103 -2.400641 1.605138
H  -4.36706 -2.23166 -0.359035
H  -4.915548 -1.140903 -1.606052
H  0.114257 -1.499693 1.670432
H  -0.066042 -3.222098 1.340426
H  -5.265818 0.665163 0.136086
H  -6.233281 -0.769982 0.436105
H  -4.799436 -0.484789 1.395049
H  -1.227148 1.772895 -0.961368
H  -3.511233 2.173568 2.557906
H  -2.082973 4.353155 -0.696628
H  4.497388 -0.365802 0.905205
H  2.353656 1.448816 -2.337275
elementType: Cl O N C H
totalener: -2276.66455797 hartree
nucrepener: 2463.34541671 hartree
electener: -4740.00997468 hartree
oneelecener: -8025.13591764 hartree
twoeener: 3285.12594296 hartree
cpcmener: -0.02606150 hartree
kineticenergy: 2270.83782716 hartree
xcener: -149.624996950413 hartree
chargesum: 0.0000000
charge: -0.066262 -0.079088 -0.076399 -0.340300 -0.459135 -0.106099 0.000951 -0.374411 -0.106815 -0.071768 -0.094425 -0.003641 0.307657 -0.284525 0.247467 -0.162877 0.055197 -0.001637 -0.009450 -0.128273 -0.094275 -0.085078 0.039682 0.127029 0.102751 0.105287 0.117675 0.067946 0.079543 0.119833 0.114437 0.089497 0.104724 0.080421 0.186706 0.170503 0.168470 0.129919 0.128763
qa: -0.0663 -0.0791 -0.0764 -0.3403 -0.4591 -0.1061 0.0010 -0.3744 -0.1068 -0.0718 -0.0944 -0.0036 0.3077 -0.2845 0.2475 -0.1629 0.0552 -0.0016 -0.0094 -0.1283 -0.0943 -0.0851 0.0397 0.1270 0.1028 0.1053 0.1177 0.0679 0.0795 0.1198 0.1144 0.0895 0.1047 0.0804 0.1867 0.1705 0.1685 0.1299 0.1288
va: 1.2432 1.2294 1.2240 2.0381 2.0450 3.0831 3.2134 3.1224 3.8877 3.9238 3.8817 3.8326 4.2940 3.9377 3.8752 3.9021 4.0313 3.9094 3.8737 4.0925 4.0162 4.0092 3.9188 0.9909 1.0098 1.0074 1.0117 1.0098 1.0113 0.9994 1.0008 1.0005 1.0058 1.0035 1.0129 1.0015 1.0020 1.0145 1.0152
dispcorr: -0.024233847 hartree
energy: -2276.688791812898
dipole: -43.65068 43.23569 -0.41499 -3.57912 1.57698 -2.00214 3.51823 -4.90989 -1.39166
magnitude: 2.47335 au
magnitude: 6.28677 debye
