program: Gaussian 09
title: 000030049
version: EM64L-G09RevD.01
frameworkgroup: C1[X(C14H19ClN2O2)]
method: RPBEPBE
basis: SDD
operation: Freq
keyword: #p
keyword: freq=noraman
keyword: PBEPBE/SDD
title: #p freq=noraman PBEPBE/SDD
converged: YES YES NO NO
title: Mulliken charges:
elementType: Cl O O N N C C C C C C C C C C C C C C H H H H H H H H H H H H H H H H H H H
charge: -0.063542 -0.314698 -0.270495 -0.081975 -0.463091 -0.363186 -0.371141 -0.392156 -0.385603 -0.399451 -0.353116 -0.267866 0.264642 0.493880 -0.434059 -0.338903 -0.184156 -0.195095 -0.120312 0.175859 0.208912 0.212559 0.169191 0.193878 0.207748 0.205359 0.193512 0.216303 0.189540 0.198285 0.218468 0.237428 0.237187 0.330536 0.229562 0.306218 0.254958 0.254822
chargesum: 0.00000
title: Mulliken charges with hydrogens summed into heavy atoms:
elementType: Cl O O N N C C C C C C C C C C C C C C
charge: -0.063542 -0.314698 -0.270495 -0.081975 -0.132555 0.021586 0.010608 0.009470 0.013268 0.006392 0.063637 0.206748 0.264642 0.493880 -0.204497 -0.032685 0.070801 0.059727 -0.120312
polarizability: 2.97403465e+02 -3.69765454e+00 1.61435405e+02 7.58582693e+00 9.44758079e+00 1.08989661e+02
1716.lowfreq: -12.3353 -0.0014 0.0002 0.0005 1.5046 4.8162 21.1171 27.2422 31.9375
frequency: 17.3755 24.1259 29.5474 52.7433 66.3058 70.5421 99.2331 121.0627 146.3117 165.1659 182.5355 228.0393 242.5504 274.7626 301.9590 320.5509 328.9755 362.3602 375.0466 399.5727 411.1468 433.3460 450.5346 485.4076 504.9736 561.0825 620.7645 638.3229 655.1411 698.6182 703.3861 706.6904 760.4560 793.3140 805.4586 813.0771 826.8382 841.6983 853.0408 857.8616 907.2934 914.1632 936.2837 958.4687 974.8260 991.1818 995.2959 1008.8518 1047.1588 1050.4444 1074.3039 1086.4354 1102.4690 1114.8569 1116.7184 1127.4004 1151.5492 1159.3225 1161.6151 1183.6677 1185.9843 1246.8310 1259.2994 1261.6172 1265.2169 1284.1601 1293.7143 1297.2286 1318.9302 1331.0864 1342.7856 1348.4623 1353.6337 1369.0994 1373.3437 1395.3249 1403.8566 1451.2124 1458.5370 1461.7682 1467.6495 1472.7100 1478.1567 1479.2878 1485.6236 1511.1314 1594.8655 1610.4384 1662.7269 2823.8800 2832.9079 2890.7471 2967.3863 2986.7542 2987.9684 3022.0272 3023.9391 3031.2142 3037.1301 3039.0508 3048.2455 3057.0129 3095.2155 3125.2381 3165.2562 3171.3223 3191.0288 3545.0360
redmass: 4.5406 4.8053 4.7147 5.5490 6.5445 3.7350 3.9376 3.1579 6.7130 4.9301 4.4781 2.8416 2.2753 4.9475 3.8760 3.0485 5.7780 4.1623 2.2974 3.0350 3.0070 3.9053 2.8818 3.6984 2.7248 1.9848 7.0487 1.2844 6.8324 4.6638 4.1700 6.8616 3.3496 1.2875 1.4005 1.3870 5.3750 1.4141 1.9079 1.8477 2.6099 5.3299 1.3574 1.3061 1.3199 4.6657 2.6064 6.0258 2.0236 1.8458 2.6212 2.8484 1.6304 1.8392 1.3841 2.1458 1.3300 2.6647 2.4774 1.2678 1.1239 1.6543 1.2550 2.0802 1.1828 1.2202 1.4018 1.3442 1.3450 1.3133 1.4325 1.4940 1.4518 2.6013 1.8880 1.5311 3.7303 1.0915 1.0878 1.0823 1.0889 1.0916 1.5794 1.3582 1.1060 2.3539 5.6836 6.2361 8.3948 1.0714 1.0699 1.0697 1.0627 1.0616 1.0610 1.0604 1.0866 1.0887 1.0932 1.0896 1.1035 1.1037 1.1089 1.0902 1.0907 1.0954 1.0957 1.0762
irintensity: 0.2739 0.6319 0.0196 0.0491 3.3278 0.1910 0.5673 1.1964 0.4281 0.7707 5.3063 3.6897 0.3344 9.4441 3.9072 5.8375 0.0923 3.1501 14.5637 30.5677 0.0064 4.5927 0.2497 1.1466 38.3520 0.3002 5.1598 43.9708 28.8546 30.0667 11.8374 9.5955 7.0699 0.8454 0.1112 43.8615 1.0839 61.8344 2.7872 10.5827 0.8557 5.8153 1.2458 2.6007 2.3041 94.3383 18.9475 266.8351 37.1747 34.1830 71.0722 24.5071 36.2725 27.1454 27.5412 5.4490 11.8350 437.4962 87.0699 21.5356 18.3639 9.8402 1.8776 3.5005 4.7466 10.3633 9.8884 18.2831 14.4613 0.4268 0.5340 0.3104 3.0623 62.6188 65.4296 0.1239 35.4152 7.1891 14.9052 1.4457 9.9741 14.9082 7.7608 39.2433 42.8038 720.7410 32.3922 54.3277 217.0991 46.1768 147.1279 95.8732 39.2635 32.3913 32.1835 34.1962 48.7446 55.1829 38.9120 23.0646 18.8017 96.7345 30.7875 13.9790 2.7168 2.7727 5.9818 31.0707
temp: 298.150 k
press: 1.00000 atm
elementType: 17 8 8 7 7 6 6 6 6 6 6 6 6 6 6 6 6 6 6 1 1 1 1 1 1 1 1 1 1 1 1 1 1 1 1 1 1 1
symmnumber: 1
zpe: 818235.4 jmol-1
zpe.correction: 0.311649 hartree
zpe.thermalcorrener: 0.330221 hartree
zpe.thermalcorrenthalpy: 0.331166 hartree
zpe.thermalcorrgfe: 0.261611 hartree
zpe.sumelectzpe: -1263.464279 hartree
zpe.sumelectthermal: -1263.445707 hartree
zpe.sumelectthermalent: -1263.444762 hartree
zpe.sumelectthermalfe: -1263.514317 hartree
dipole: -3.7922 2.8843 1.1615
dipole: 4.9040
quadrupole: -127.0861 -113.6915 -122.8312
quadrupole: 4.6728 -1.1494 0.6260
quadrupole: -5.8832 7.5115 -1.6283 4.6728 -1.1494 0.6260
hfenergy: -1263.775928 hartree
pointgroup: C01 [X(C14H19Cl1N2O2)]
dipole: -1.479788 -1.142347 -0.4771974 debye
polarizability: 297.3685433|5.0390882|161.2519345|-7.0133639|10.102243|109.2080545 unknown
InChI: InChI=1S/C14H19ClN2O2/c15-12-4-6-13(7-5-12)16-14(18)19-11-10-17-8-2-1-3-9-17/h4-7,16H,1-3,8-11H2
charge 0 multiplicity 1
38 atoms
Cl 7.735777 0.586626 -0.075393
O  -0.426477 -0.704802 0.113275
O  0.745402 1.281667 0.604397
N  -4.142013 -0.249444 0.076965
N  1.823693 -0.733752 -0.034983
C  -4.472958 0.814224 -0.9079
C  -5.248596 -1.232555 0.206682
C  -5.750633 1.572701 -0.496248
C  -6.55087 -0.537195 0.654725
C  -6.93472 0.593796 -0.326604
C  -2.825377 -0.878543 -0.175053
C  -1.709045 -0.018438 0.432094
C  0.73519 0.073454 0.263012
C  3.197037 -0.3734 -0.028782
C  4.141014 -1.378355 -0.372786
C  3.650648 0.931446 0.303175
C  5.520969 -1.09265 -0.388571
C  5.032505 1.216544 0.2873
C  5.950322 0.206909 -0.05713
H  -4.620694 0.373611 -1.930274
H  -3.623618 1.518307 -0.975806
H  -4.951156 -1.994944 0.950595
H  -5.435635 -1.765169 -0.763874
H  -5.983457 2.33982 -1.259604
H  -5.561445 2.096208 0.460531
H  -6.394896 -0.112078 1.665013
H  -7.362132 -1.287121 0.725576
H  -7.833174 1.130003 0.032681
H  -7.192782 0.154117 -1.312682
H  -2.621105 -1.037299 -1.261703
H  -2.805793 -1.873013 0.306981
H  -1.81761 0.05119 1.528189
H  -1.680311 1.002878 0.014647
H  1.587955 -1.69541 -0.289045
H  3.801111 -2.389047 -0.629846
H  2.927695 1.705211 0.568563
H  6.244891 -1.868271 -0.653753
H  5.385685 2.219774 0.542537
