program: Orca
programVersion: 4.2.1
elementType: Cl Cl Cl O O N N N C C C C C C C C C C C C C C C H H H H H H H H H H H H H H H H
charge: 0
multiplicity: 1
keywords: wb97x-d3
keywords: def2-TZVPP
keywords: def2/J RIJCOSX GRIDX6 NOFINALGRIDX
keywords: grid4 nofinalgrid
keywords: scfconv7
keywords: smallprint printgap noloewdin
keywords: NOSOSCF
formula: C15H16Cl3N3O2
InChI: InChI=1S/C15H16Cl3N3O2/c1-2-4-20(15(22)21-5-3-19-10-21)6-7-23-14-12(17)8-11(16)9-13(14)18/h3,5,8-10H,2,4,6-7H2,1H3
39 atoms
Cl 2.541032 -1.889556 1.975588
Cl 0.411808 0.692785 -2.213613
Cl 5.710086 -0.11021 -1.974634
O  0.391245 -0.684821 0.39021
O  -2.486388 0.048174 2.694432
N  -2.380963 -0.538394 0.492906
N  -2.929985 1.642795 1.143111
N  -3.890298 3.621533 1.291982
C  -3.063115 -0.45904 -0.791249
C  -1.676994 -1.770786 0.778405
C  -4.353308 -1.273734 -0.843396
C  -0.354125 -1.843725 0.042277
C  -2.58697 0.323088 1.526199
C  -5.397882 -0.815068 0.163564
C  1.607224 -0.582052 -0.17026
C  -2.350727 2.431556 0.17273
C  -3.834586 2.429281 1.796028
C  2.737191 -1.090646 0.467298
C  1.788324 0.05908 -1.393015
C  -2.9607 3.640355 0.287683
C  4.003374 -0.947845 -0.074055
C  3.042559 0.21593 -1.957381
C  4.141215 -0.295581 -1.287754
H  -3.294324 0.577259 -1.026077
H  -2.37473 -0.79394 -1.570318
H  -2.279961 -2.639024 0.496947
H  -1.5064 -1.841455 1.850259
H  -4.143681 -2.338055 -0.704664
H  -4.750652 -1.18114 -1.857582
H  0.173513 -2.755067 0.344233
H  -0.497459 -1.890373 -1.043118
H  -5.079029 -0.991502 1.19136
H  -5.611439 0.24998 0.057908
H  -6.33547 -1.352461 0.024247
H  -1.547349 2.07975 -0.451692
H  -4.422449 2.056071 2.619696
H  -2.773593 4.530528 -0.291211
H  4.865331 -1.342855 0.443726
H  3.157325 0.725601 -2.902975
totalener: -2276.63820688 hartree
nucrepener: 2409.72361342 hartree
electener: -4686.36182030 hartree
oneelecener: -7917.87656727 hartree
twoeener: 3231.51474697 hartree
kineticenergy: 2270.88118697 hartree
xcener: -149.628694894760 hartree
chargesum: 0.0000000
charge: -0.041767 -0.068657 -0.056763 -0.307656 -0.355484 -0.110165 -0.012991 -0.299531 -0.107541 -0.078336 -0.109102 -0.056630 0.279312 -0.261535 0.252978 -0.166551 0.049246 -0.034751 0.017673 -0.083914 -0.103075 -0.117904 0.046013 0.122056 0.087168 0.095322 0.120237 0.059650 0.072126 0.115797 0.099075 0.083466 0.089629 0.098056 0.163842 0.144395 0.129504 0.121599 0.125208
qa: -0.0418 -0.0687 -0.0568 -0.3077 -0.3555 -0.1102 -0.0130 -0.2995 -0.1075 -0.0783 -0.1091 -0.0566 0.2793 -0.2615 0.2530 -0.1666 0.0492 -0.0348 0.0177 -0.0839 -0.1031 -0.1179 0.0460 0.1221 0.0872 0.0953 0.1202 0.0596 0.0721 0.1158 0.0991 0.0835 0.0896 0.0981 0.1638 0.1444 0.1295 0.1216 0.1252
va: 1.2737 1.2447 1.2444 2.0171 2.1458 3.0288 3.2184 3.1338 3.8937 3.8945 3.8897 3.8763 4.3035 3.9333 3.7977 3.8912 4.0393 4.0078 3.9523 4.0789 4.0167 4.0342 3.9557 0.9950 1.0101 1.0030 1.0393 1.0067 1.0133 1.0065 0.9924 1.0071 1.0036 1.0083 1.0198 1.0077 1.0098 1.0194 1.0158
dispcorr: -0.023116795 hartree
energy: -2276.661323672976
dipole: -45.78438 46.19442 0.41004 -4.79558 3.00416 -1.79142 0.57207 -2.22138 -1.64931
magnitude: 2.46932 au
magnitude: 6.27651 debye
