program: Gaussian 09
title: 000030089
version: EM64L-G09RevD.01
frameworkgroup: C1[X(C19H21N3O)]
method: RPBEPBE
basis: SDD
operation: Freq
keyword: #p
keyword: freq=noraman
keyword: PBEPBE/SDD
title: #p freq=noraman PBEPBE/SDD
converged: YES YES NO NO
title: Mulliken charges:
elementType: O N N N C C C C C C C C C C C C C C C C C C C H H H H H H H H H H H H H H H H H H H H H
charge: -0.244171 -0.091167 -0.411998 -0.054583 -0.383221 -0.334216 -0.350349 -0.390397 -0.322797 -0.315541 0.292407 0.211124 0.243749 -0.096145 -0.098778 -0.310517 -0.348567 -0.319341 -0.313671 -0.294212 -0.283073 -0.234280 -0.235794 0.205285 0.197044 0.208355 0.198384 0.194875 0.210933 0.228630 0.251803 0.218516 0.193967 0.194050 0.216520 0.289408 0.251454 0.184947 0.264095 0.265089 0.226336 0.225725 0.229690 0.230432
chargesum: 0.00000
title: Mulliken charges with hydrogens summed into heavy atoms:
elementType: O N N N C C C C C C C C C C C C C C C C C C C
charge: -0.244171 -0.091167 -0.122590 -0.054583 0.019108 0.072522 0.055458 0.090036 0.089686 0.095029 0.292407 0.211124 0.243749 -0.096145 -0.098778 -0.059063 -0.163620 -0.055246 -0.048582 -0.067876 -0.057348 -0.004590 -0.005361
polarizability: 2.82342105e+02 -1.92764377e+01 3.25235027e+02 4.22155476e+01 2.24723513e+00 1.38531301e+02
1716.lowfreq: -4.0161 -0.0004 0.0007 0.0009 3.1126 6.9927 16.4909 25.0421 28.7134
frequency: 16.4688 24.9715 28.6934 62.0414 68.8618 102.9987 112.5865 147.4827 166.2189 212.6985 220.5389 237.6040 244.7852 260.2012 303.1676 321.4368 323.0217 381.6465 396.4764 410.0862 422.3385 434.5158 463.2789 465.5688 472.3528 507.3616 516.2281 541.6599 579.4904 589.6128 606.8896 621.7297 642.2991 645.3424 683.0142 742.8252 755.7008 765.3590 768.1440 795.1815 805.1210 812.0311 836.9029 841.6425 860.0681 866.6267 872.4204 901.5262 921.0961 946.4835 959.7113 990.0632 990.7830 998.2807 1021.8293 1024.9289 1026.8634 1029.1541 1052.9922 1057.3884 1072.2063 1093.6056 1109.0855 1109.7523 1130.5945 1136.9638 1157.5929 1162.6485 1169.0264 1191.7415 1194.2045 1216.0910 1228.4084 1249.9690 1258.8179 1272.7460 1278.3725 1286.6409 1293.7422 1295.7680 1318.1063 1333.4524 1347.1134 1356.3874 1365.1044 1371.9295 1377.9666 1388.8947 1401.5307 1432.0721 1442.4426 1443.3463 1448.4548 1450.8533 1452.3226 1460.4487 1468.5754 1474.3398 1489.7540 1505.1796 1526.4793 1554.8254 1558.0253 1611.8954 1629.0882 2862.1313 2869.0244 2879.8672 2955.7633 2959.4870 2977.4283 2995.0285 3026.0808 3038.3441 3071.9795 3082.6136 3086.0847 3104.8495 3129.1630 3133.5481 3145.7085 3152.6379 3166.0614 3169.6139 3175.4565 3539.4630
redmass: 5.1776 3.0186 5.0786 4.0329 4.3851 3.6145 4.6712 2.3003 4.5767 3.3871 3.4579 1.9319 3.9697 4.4027 4.8785 2.8892 3.1400 3.6317 2.5830 3.4858 3.6204 5.0143 2.4457 3.6379 3.4806 3.0067 1.7170 4.5309 3.6388 4.7701 2.4853 4.4397 5.3419 4.1559 5.2544 3.4224 1.4476 2.1920 1.9547 2.3889 1.9292 2.1030 4.7614 1.6282 1.8350 3.1695 2.0533 2.4391 5.3327 1.3701 1.3485 1.3267 1.3206 2.9250 2.4613 2.2154 2.2443 3.0043 2.2150 2.7977 2.3374 3.1769 2.1268 2.2956 1.8551 2.5280 1.6236 1.5857 1.3226 1.2059 1.3694 1.2488 1.4161 2.6797 1.3761 1.3054 2.0318 1.7972 1.2763 1.3559 1.4678 1.2691 1.3385 1.9675 1.4207 1.2652 3.4283 1.4199 3.4928 2.8340 2.4801 1.0851 1.0851 2.7485 1.0988 1.1111 2.2666 1.1210 1.1271 3.3181 6.3574 6.7468 3.2566 5.5721 6.4334 1.0686 1.0704 1.0684 1.0665 1.0666 1.0658 1.0890 1.0901 1.0903 1.0979 1.0963 1.0978 1.0864 1.0857 1.0880 1.0899 1.0942 1.0955 1.0992 1.0971 1.0744
irintensity: 0.8530 0.2672 0.5974 0.5413 1.0792 0.4664 3.5415 1.6063 0.7910 3.2239 6.0479 1.0973 1.4930 1.5046 2.0110 20.1664 0.1588 0.1651 0.7086 2.1523 5.6840 0.2113 15.4159 1.4272 0.6093 8.9784 46.5800 3.8640 6.9044 14.2632 9.5388 22.6041 13.8364 24.4591 2.9113 5.2643 74.4882 67.3220 34.3183 6.2513 9.8239 16.9216 2.4438 0.2336 4.3494 1.8155 5.2996 6.6860 7.6589 1.1078 2.2232 0.0158 0.9904 24.0462 5.1948 11.2315 7.7705 12.6241 24.9023 1.7767 6.6536 36.7741 0.4645 3.8035 29.4055 93.2070 8.8519 5.6121 1.6158 2.6659 3.8518 11.8583 5.7540 2.0435 18.9248 4.0737 7.8342 4.4468 1.5592 15.0569 12.2455 1.5695 3.2680 10.5469 1.7814 3.4402 68.2948 1.7042 33.2373 56.1614 22.1645 3.9912 0.9503 0.1679 23.2756 15.8011 20.1589 7.6622 39.3580 244.1326 48.4910 127.8305 30.8142 31.1956 12.9730 41.4572 42.4366 134.2965 32.4490 93.3270 49.7632 23.5891 48.2495 35.7525 23.0354 38.5801 31.9243 13.9584 6.3622 13.4095 13.1509 25.4204 21.3720 30.3409 25.3825 19.7154
temp: 298.150 k
press: 1.00000 atm
elementType: 8 7 7 7 6 6 6 6 6 6 6 6 6 6 6 6 6 6 6 6 6 6 6 1 1 1 1 1 1 1 1 1 1 1 1 1 1 1 1 1 1 1 1 1
symmnumber: 1
zpe: 954103.8 jmol-1
zpe.correction: 0.363399 hartree
zpe.thermalcorrener: 0.382807 hartree
zpe.thermalcorrenthalpy: 0.383751 hartree
zpe.thermalcorrgfe: 0.313533 hartree
zpe.sumelectzpe: -974.414587 hartree
zpe.sumelectthermal: -974.395179 hartree
zpe.sumelectthermalent: -974.394235 hartree
zpe.sumelectthermalfe: -974.464453 hartree
dipole: -2.9538 -1.8266 -1.8048
dipole: 3.9139
quadrupole: -158.1800 -117.9960 -139.7936
quadrupole: -1.3089 8.5640 3.2262
quadrupole: -19.5235 20.6605 -1.1371 -1.3089 8.5640 3.2262
hfenergy: -974.777986 hartree
pointgroup: C01 [X(C19H21N3O1)]
dipole: 1.0938551 0.8577155 -0.6625488 debye
polarizability: 287.1091129|-21.0923661|321.3730454|-41.5528667|1.8774819|137.6262748 unknown
InChI: InChI=1S/C19H21N3O/c1-3-7-17-15(5-1)19(16-6-2-4-8-18(16)21-17)20-9-10-22-11-13-23-14-12-22/h1-8,20H,9-14H2
charge 0 multiplicity 1
44 atoms
O  6.395712 0.517686 0.99249
N  3.754038 0.779498 -0.194841
N  0.061528 0.621191 -1.03739
N  -3.611642 -0.943467 0.566905
C  2.357444 1.24285 -0.339771
C  3.975972 -0.04075 1.027077
C  4.742113 1.889694 -0.251472
C  1.426484 0.103668 -0.824041
C  5.415863 -0.579177 1.043043
C  6.170661 1.321324 -0.220386
C  -1.132209 0.085119 -0.556562
C  -1.35876 -1.33291 -0.449024
C  -2.201072 0.978848 -0.170655
C  -2.604444 -1.783208 0.168467
C  -3.42632 0.400615 0.364564
C  -0.466476 -2.333534 -0.976703
C  -2.108617 2.410904 -0.259906
C  -2.822976 -3.196599 0.341541
C  -4.50649 1.278062 0.733205
C  -0.73032 -3.693146 -0.825642
C  -3.173924 3.232659 0.107292
C  -1.907719 -4.130937 -0.13127
C  -4.391801 2.658547 0.601583
H  1.945737 1.67624 0.606616
H  2.349496 2.051238 -1.099351
H  3.274099 -0.894433 1.036618
H  3.7983 0.561031 1.953756
H  4.616172 2.59941 0.604541
H  4.59383 2.454837 -1.191335
H  1.863093 -0.324369 -1.748165
H  1.38231 -0.698168 -0.068556
H  5.626202 -1.119898 1.980351
H  5.567719 -1.258177 0.176477
H  6.339743 0.694185 -1.12227
H  6.919536 2.129511 -0.183326
H  0.022922 1.599639 -1.326634
H  0.411281 -2.028836 -1.551762
H  -1.186856 2.893847 -0.608255
H  -3.752916 -3.492022 0.837014
H  -5.413445 0.804088 1.120962
H  -0.045147 -4.43317 -1.253501
H  -3.078343 4.321222 0.029878
H  -2.095334 -5.202692 -0.001977
H  -5.223942 3.312479 0.884812
